voc
type: Vocabulary
type: Ontology
license: data:text/html;charset=UTF-8, GS1®, under its IP Policy, seeks to avoid uncertainty regarding intellectual property claims by requiring the participants in the Work Groups that developed this vocabulary to agree to grant to GS1 members a royalty-free licence or a RAND licence to Necessary Claims, as that term is defined in the GS1 IP Policy. Furthermore, attention is drawn to the possibility that an implementation of one or more features of this vocabulary may be the subject of a patent or other intellectual property right that does not involve a Necessary Claim. Any such patent or other intellectual property right is not subject to the licencing obligations of GS1. Moreover, the agreement to grant licences provided under the GS1 IP Policy does not include IP rights and any claims of third parties who were not participants in the Work Groups. Accordingly, GS1 recommends that any organisation developing an implementation designed to be in conformance with this vocabulary should determine whether there are any patents that may encompass a specific implementation that the organisation is developing in compliance with the vocabulary and whether a licence under a patent or other intellectual property right is needed. Such a determination of a need for licencing should be made in view of the details of the specific system designed by the organisation in consultation with their own patent counsel. THIS DOCUMENT IS PROVIDED "AS IS" WITH NO WARRANTIES WHATSOEVER, INCLUDING ANY WARRANTY OF MERCHANTABILITY, NONINFRINGMENT, FITNESS FOR PARTICULAR PURPOSE, OR ANY WARRANTY OTHER WISE ARISING OUT OF THIS SPECIFICATION. GS1 disclaims all liability for any damages arising from use or misuse of this vocabulary, whether special, indirect, consequential, or compensatory damages, and including liability for infringement of any intellectual property rights, relating to use of information in or reliance upon this document. GS1 retains the right to make changes to this vocabulary at any ti…
contributors: Eric Kauz, Mark Harrison, Phil Archer
creator: www.gs1.org
description:: The GS1 RDF vocabulary, described using W3C RDF Schema and the Web Ontology Language. The vocabulary builds on and refers to schema.org where appropriate.
identifier:: GS1 Vocabulary
title: GS1 Vocabulary
issued:: 2017-11-20
last modified: 2025-11-18
version info: 1.17
preferred namespace prefix: gs1
extends: schema.org
has equivalences with: schema.org
specializes: schema.org

Additional Product Classification Details
type: Class
comment: A product classification for the product other than the Global Product Classification(GPC brick value).
subclass of: Thing
term status: stable
equivalent class: AdditionalProductClassificationDetails

Additive Details
type: Class
comment: A set of details about one of the additives within the product.
subclass of: Thing
term status: stable
equivalent class: AdditiveDetails

Allergen Details
type: Class
comment: Details of an allergen for a product.
subclass of: Thing
term status: stable
equivalent class: AllergenDetails

Authenticity Details
type: Class
comment: A set of details about covert or overt security features that may contribute to checking the authenticity of a product or product instance.
subclass of: Thing
term status: stable
equivalent class: AuthenticityDetails

Award Prize
type: Class
comment: Describes a prize or award won by a product or organization.
subclass of: Thing
term status: stable
equivalent class: AwardPrizeDetails

Beverage
type: Class
comment: Any potable liquid.
subclass of: Food Beverage Tobacco Product
term status: stable
equivalent class: Beverage

Brand
type: Class
comment: Information on brands and sub-brands for a product.
subclass of: Thing
term status: stable
equivalent class: Brand

Certification
type: Class
comment: Certification issued by a certifying body to a certification subject (Organization, Place, Product).
subclass of: Thing
term status: stable
equivalent class: CertificationDetails

Clothing
type: Class
comment: A product that is worn on the body.
subclass of: Wearable Product
term status: stable
equivalent class: Clothing

Colour Code Details
type: Class
comment: A set of colour code details (colour code, party controlling the code list) for the product.
subclass of: Thing
term status: stable
equivalent class: ColourCodeDetails

Compulsory Additional Information
type: Class
comment: The group of compulsory information about a product.
subclass of: Thing
term status: stable
equivalent class: CompulsoryAdditionalInformation

Contact
type: Class
comment: Information on an individual or department acting as point of contact for an organiation.
subclass of: Thing
term status: stable
equivalent class: ContactPoint

Country
type: Class
comment: Country is a complex data type that indicates a country and a country subdivision.
subclass of: Thing
term status: stable
equivalent class: Country

Diet Type Code Details
type: Class
comment: A set of diet type code details (diet type code and diet type sub code) for the product.
subclass of: Thing
term status: stable
equivalent class: DietTypeCodeDetails

Discount
type: Class
comment: Provides information on a discount applicable to an offer for example 2 percent.
term status: stable
equivalent class: Discount

Food and Beverage Preparation Information
type: Class
comment: Food and Beverage Preparation Information is a complex data type that indicates a preparation state code and preparation instructions.
subclass of: Thing
term status: stable
equivalent class: FoodAndBeveragePreparationInformation

Food Beverage Tobacco Ingredient
type: Class
comment: Food Beverage Tobacco Ingredient is a complex data type that includes an ingredient statement and details.
subclass of: Thing
term status: stable
equivalent class: FoodBeverageTobaccoIngredientDetails

Food Beverage Tobacco Product
type: Class
comment: A food, beverage or tobacco product.
subclass of: Product
term status: stable
equivalent class: FoodBeverageTobaccoProduct

Footwear
type: Class
comment: Outerwear that is worn on the feet such as shoes or boots.
subclass of: Wearable Product
term status: stable
equivalent class: Footwear

Fruits and Vegetables
type: Class
comment: Contains properties related specifically to fruit and vegetable products.
subclass of: Food Beverage Tobacco Product
term status: stable
equivalent class: FruitsVegetables

GeoCoordinates
type: Class
comment: The geographic coordinates of a place or event.
subclass of: Thing
term status: stable
equivalent class: GeoCoordinates

GeoShape
type: Class
comment: The geographic shape of a place. A GeoShape can be described using several properties whose values are based on latitude/longitude pairs. Either whitespace or commas can be used to separate latitude and longitude; whitespace should be used when writing a list of several such points.
subclass of: Thing
term status: stable
equivalent class: GeoShape

Location ID Details
type: Class
comment: Government bodies, trade organisations, and other parties issue identifiers that are associated to locations. Linking these identifiers to GLN and one another supports consolidating records, mapping related, collaborative identifiers, enhances search ability and enables more efficient transitions between identifiers. This class provides a mechanism for connecting and sharing location identifiers.
subclass of: Thing
term status: stable
equivalent class: LocationID Details

Location Status History
type: Class
comment: Over the lifetime of a location, it may go through periods of being active and inactive. gs1:LocationStatusHistory allows changes in status to be communicated in advance and tracked over time.
subclass of: Thing
term status: stable
equivalent class: LocationStatusHistory

Meat Poultry
type: Class
comment: Meat and poultry products.
subclass of: Food Beverage Tobacco Product
term status: stable
equivalent class: MeatPoultry

Message
type: Class
comment: Any kind of electronic message for communication of information from one party to one or more other parties.
term status: provisional

Milk Butter Cream Yogurt Cheese Eggs Substitutes
type: Class
comment: Milk butter cream yogurts cheese eggs and any substitutes for these products.
subclass of: Food Beverage Tobacco Product
term status: stable
equivalent class: MilkButterCreamYogurtCheeseEggsSubstitutes

Nutrition Measurement Type
type: Class
comment: A class providing nutritional value and intake percent.
subclass of: Measurement Type
term status: stable
equivalent class: NutritionMeasurementType

Offer
type: Class
comment: An offer to transfer some rights to an item or to provide a service,for example, an offer to sell tickets to an event, to rent the DVD of a movie, to stream a TV show over the internet, to repair a motorcycle, or to loan a book.
subclass of: Thing
term status: stable
equivalent class: Offer

Organic Claim Details
type: Class
comment: A set of organic claim details for the product.
subclass of: Thing
term status: stable
equivalent class: OrganicClaimDetails

Organization
type: Class
comment: An Organization is any legal or physical entity involved at any point in any supply chain and upon which there is a need to retrieve predefined information. An Organization is uniquely identified by a Global Location Number (GLN).
subclass of: Thing
term status: stable
equivalent class: Organization

Organisation ID Details
type: Class
comment: Government bodies, trade organisations, and other parties issue identifiers that are associated to legal entities and/or functions. Linking these identifiers to GLN and one another supports consolidating records, mapping related, collaborative identifiers, enhances search ability and enables more efficient transitions between identifiers. This class provides a mechanism for connecting and sharing party identifiers.
subclass of: Thing
term status: stable
equivalent class: OrganizationID Details

Organisation Status History
type: Class
comment: Over the lifetime of an organisation, it may go through periods of being active and inactive. gs1:OrganizationStatusHistory allows changes in status to be communicated in advance and tracked over time.
subclass of: Thing
term status: stable
equivalent class: OrganizationStatusHistory

Packaging
type: Class
comment: Details on packaging for a product for example packaging type (bottle), materials, features, recycling, etc..
subclass of: Thing
term status: stable
equivalent class: PackagingDetails

Packaging Material Details
type: Class
comment: Information on any material used for packaging.
subclass of: Thing
term status: stable
equivalent class: PackagingMaterialDetails

Place
type: Class
comment: Entities that have a somewhat fixed, physical location.
subclass of: Thing
broad match: Place
term status: stable
equivalent class: Place

Address
type: Class
comment: The location at which a particular organization or person may be found or reached.
subclass of: Thing
term status: stable
equivalent class: PostalAddress

Price Specification
type: Class
comment: A structured value representing a monetary amount, consisting of a value and currency code.
subclass of: Thing
term status: stable
equivalent class: PriceSpecification

Product
type: Class
comment: Any item (product or service) upon which there is a need to retrieve pre-defined information and that may be priced, or ordered, or invoiced at any point in any supply chain.
subclass of: Thing
term status: stable
equivalent class: Product

Product Yield Details
type: Class
comment: A grouping of properties related to the yield of a food or beverage product according to a specified type of preparation.
subclass of: Thing
term status: stable
equivalent class: ProductYieldDetails

Measurement Type
type: Class
comment: A point value or interval for product characteristics and other purposes. A unit of measurement is also specified.
subclass of: Thing
term status: stable
equivalent class: QuantitativeValue

Referenced File
type: Class
comment: Provides URL and other information on a referenced electronic file.
subclass of: Thing
subclass of: MediaObject
term status: stable
equivalent class: ReferencedFileDetails

Regulatory Identifier
type: Class
comment: A repeatable grouping of identifiers that reference one document, record or dataset within one regulatory information system, repository or registry
term status: provisional

Regulatory Information
type: Class
comment: Information on applicable government regulations applicable to a trade item
term status: provisional

Regulatory Notification
type: Class
comment: A notification message about information on applicable government regulations applicable to a trade item
subclass of: Message
term status: provisional

Returnable Package Deposit Details
type: Class
comment: Details of the deposit for returnable packaging for a product.
subclass of: Thing
term status: stable
equivalent class: ReturnablePackageDepositDetails

Seafood
type: Class
comment: Seafood Products including fish and shellfish.
subclass of: Food Beverage Tobacco Product
term status: stable
equivalent class: Seafood

Size Code Details
type: Class
comment: A grouping of properties related to the representing the size of a product, by specifying a value from a specified code list.
subclass of: Thing
term status: stable
equivalent class: SizeCodeDetails

Size Details
type: Class
comment: A grouping of properties related to the size of a wearable product
subclass of: Thing
term status: stable
equivalent class: SizeDetails

Target Market Details
type: Class
comment: A set of target market details (product release date and associated countries) for the product.
subclass of: Thing
term status: stable
equivalent class: TargetMarketDetails

Textile Material
type: Class
comment: Details on the composition of any materials used to make a product using textiles.
subclass of: Thing
term status: stable
equivalent class: TextileMaterialDetails

Transaction
type: Class
comment: A repeatable grouping of identifiers that identify a business transaction ID and its type
term status: provisional

Type Code
type: Class
comment: A code list.
subclass of: Thing
term status: stable
equivalent class: TypeCode

Warranty
type: Class
comment: An assurance that the product is reliable and that repairs or replacement will be done free of charge within a given time limit and under certain conditions in the event of a defect.
subclass of: Thing
term status: stable
equivalent class: WarrantyPromise

Wearable Product
type: Class
comment: Products that are worn on the body.
subclass of: Product
term status: stable
equivalent class: WearableProduct

Accepted Payment Method
type: Property
type: ObjectProperty
comment: Code indicating a means of payment, for example, BANK_CHEQUE, CASH, etc.
domain: Offer
range: Payment Method Code
term status: stable
equivalent property: acceptedPaymentMethod

Activity Ideas
type: Property
type: ObjectProperty
comment: A link to ideas for using a product or engaging in other forms of entertainment, particularly with children.
domain: Thing
range: anyURI
sub property of: Link Type
term status: stable
equivalent property: activityIdeas

Has Additional Location ID
type: Property
type: ObjectProperty
comment: Location identifiers assigned and managed by government bodies, trade organisations, and other entities.
domain: Place
range: Location ID Details
term status: stable
equivalent property: additionalLocationID

Has Additional Organization ID
type: Property
type: ObjectProperty
comment: Party/organisation identifiers assigned and managed by government bodies, trade organisations, and other entities.
domain: Organization
range: Organisation ID Details
term status: stable
equivalent property: additionalOrganizationID

Additional Organization Identification Type Value
type: DatatypeProperty
type: Property
comment: The value associated with the Additional Organization Identification Type Value.
domain: Organization
range: string
term status: stable
equivalent property: additionalOrganizationIdentificationTypeValue

Has Additional Product Classification
type: ObjectProperty
type: Property
comment: Relates to a set of additional product classification details
domain: Product
range: Additional Product Classification Details
term status: stable
equivalent property: additionalProductClassification

Additional Product Classification Code
type: Property
type: FunctionalProperty
type: DatatypeProperty
comment: Code specifying the applied additional product classification scheme.
domain: Additional Product Classification Details
range: string
term status: stable
equivalent property: additionalProductClassificationCode

Additional Product Classification Code Description
type: Property
type: DatatypeProperty
type: FunctionalProperty
comment: A description related to the additional product classification code value.
domain: Additional Product Classification Details
range: langString
term status: stable
equivalent property: additionalProductClassificationCodeDescription

Additional Product Classification Value
type: FunctionalProperty
type: DatatypeProperty
type: Property
comment: Code specifying an additional product classification other than the GS1 Global Product Classification. The applied classification scheme is specified as additional information together with the classification value.
domain: Additional Product Classification Details
range: string
term status: stable
equivalent property: additionalProductClassificationValue

Additional Product Description
type: Property
type: FunctionalProperty
type: DatatypeProperty
comment: Additional variants necessary to communicate to the industry to help define the product. Multiple variants can be established for each GTIN for e.g. Style, Colour, and Fragrance .
domain: Product
range: langString
term status: stable
equivalent property: additionalProductDescription

Has Additive
type: Property
type: ObjectProperty
comment: Relates to details about any additives that a product may contain.
domain: Product
range: Additive Details
term status: stable
equivalent property: additive

Additive Level Of Containment
type: FunctionalProperty
type: ObjectProperty
type: Property
comment: Code indicating the level of presence of the additive.
domain: Additive Details
range: Level Of Containment Code
term status: stable
equivalent property: additiveLevelOfContainment

Additive Name
type: Property
type: DatatypeProperty
type: FunctionalProperty
comment: The name of any additive or genetic modification contained or not contained in the product .
domain: Additive Details
range: langString
term status: stable
equivalent property: additiveName

Has Postal Address
type: Property
type: ObjectProperty
comment: The postal address for an organization or place.
domain: Class
range: Address
term status: stable
equivalent property: address

Address Country
type: ObjectProperty
type: Property
comment: Code specifying the country (and country subdivision) for the address using ISO 3166-1.
domain: Address
range: Country
term status: stable
equivalent property: addressCountry

Address Locality
type: DatatypeProperty
type: Property
comment: Text specifying the name of the locality, for example a city.
domain: Address
range: langString
term status: stable
equivalent property: addressLocality

Province State Code
type: DatatypeProperty
type: Property
comment: Text specifying a province or state in abbreviated format for example NJ.
domain: Address
range: langString
term status: stable
equivalent property: addressRegion

Address Suburb
type: DatatypeProperty
type: Property
comment: A suburb within a town or city.
domain: Address
range: langString
term status: stable
equivalent property: addressSuburb

Affiliated to
type: Property
type: ObjectProperty
comment: Method for associating an organisation/party affiliated to the identified organisation e.g., when engaged in an agent relationship (insurance, shipping, etc).
domain: Organization
range: Organization
term status: stable

Has After Hours Contact
type: ObjectProperty
type: Property
comment: Links to after-hours contact information. For general contact details, gs1:contactPoint SHALL be used.
domain: Class
range: Contact
sub property of: Has Business Contact
sub property of: contactPoint
broad match: contactPoint
term status: stable
equivalent property: afterHoursContact

Alcoholic Beverage Sub-region
type: Property
type: DatatypeProperty
comment: A legally defined geographical region where the grapes for a wine were grown also known as an appellation. It is recommended to populate this property with an ISO 3166-2 code to indicate country and subdivision.
domain: Beverage
range: langString
term status: stable
equivalent property: alcoholicBeverageSubregion

Allergen information
type: Property
type: ObjectProperty
comment: A link to a description of the allergen information.
domain: Thing
range: anyURI
sub property of: Link Type
term status: stable
equivalent property: allergenInfo

Allergen Level Of Containment
type: ObjectProperty
type: Property
comment: Code specifying the level of presence of the allergen.
domain: Allergen Details
range: Level Of Containment Code
term status: stable
equivalent property: allergenLevelOfContainmentCode

Allergen Specification Agency
type: Property
type: DatatypeProperty
comment: The agency or other organization that defines or manages the criteria for allergen containment.
domain: Food Beverage Tobacco Product
range: langString
term status: stable
equivalent property: allergenSpecificationAgency

Allergen Specification Name
type: DatatypeProperty
type: Property
comment: Free text field containing the name and version of the regulation or standard that defines the criteria of allergen containment.
domain: Food Beverage Tobacco Product
range: langString
term status: stable
equivalent property: allergenSpecificationName

Allergen Statement
type: DatatypeProperty
type: Property
comment: Textual description of the presence or absence of allergens as governed by local rules and regulations, specified as one string.
domain: Food Beverage Tobacco Product
range: langString
term status: stable
equivalent property: allergenStatement

Allergen Type Code
type: Property
type: ObjectProperty
comment: Code specifying the type of allergen.
domain: Allergen Details
range: Allergen Type Code
term status: stable
equivalent property: allergenType

Anatomical Form
type: Property
type: ObjectProperty
comment: Describes the meat product in terms of whether it is the whole animal or part of the animal which has been cut such as the muscle, bone, organ, or fat.
domain: Meat Poultry
range: Anatomical Form Code
term status: stable
equivalent property: anatomicalForm

App download
type: Property
type: ObjectProperty
comment: A link to a related mobile app
domain: Thing
range: anyURI
sub property of: Link Type
term status: stable
equivalent property: appDownload

Applicable Products
type: Property
type: ObjectProperty
comment: The set of product identifiers for which this regulatory notification message applies.
domain: Regulatory Identifier
range: Product
term status: provisional

Applicable to
type: DatatypeProperty
type: Property
comment: A property linking a gs1:linkType to the primary GS1 key(s) for which it can be used. Similar to rdfs:Domain but the value space is a GS1 Application Identifier, not a class.
domain: Link Type
range: GS1 Application Identifier
term status: stable
equivalent property: applicableTo

Applicable Transactions
type: Property
type: ObjectProperty
comment: References one or more business transactions
domain: Regulatory Information
range: Transaction
term status: provisional

Has Audio File
type: Property
type: ObjectProperty
comment: Link to a file containing an audio clip which is relevant to the product. Examples are commercials, or instructional/ how to use audio files.
domain: Product
range: Referenced File
term status: stable
equivalent property: audioFile

Has Authenticity Details
type: Property
type: ObjectProperty
comment: Links to details of covert/overt security markings that may be used to check authenticity of a product instance.
domain: Product
range: Authenticity Details
term status: stable
equivalent property: authenticity

Authenticity Security Feature Instructions
type: Property
type: DatatypeProperty
comment: Provides human-readable instructions about how to locate a physical security marking and read a value from it.
domain: Authenticity Details
range: langString
term status: stable
equivalent property: authenticitySecurityFeatureInstructions

Authenticity Security Feature Instructions Link
type: Property
type: ObjectProperty
comment: Links to online instructions about how to locate a physical security marking and read a value from it.
domain: Authenticity Details
range: anyURI
term status: stable
equivalent property: authenticitySecurityFeatureInstructionsURL

Authenticity Security Feature Regular Expression
type: Property
type: DatatypeProperty
comment: Links to a regular expression to be used to perform syntax validation (plausibility checking) of a string value read from a physical security marking.
domain: Authenticity Details
range: string
term status: stable
equivalent property: authenticitySecurityFeatureRegularExpression

Authenticity Security Feature Type
type: Property
type: ObjectProperty
comment: Links to a URI code value indicating a particular type of physical security marking.
domain: Authenticity Details
range: Security Marking code list
term status: stable
equivalent property: authenticitySecurityFeatureType

Authenticity Security Feature Value
type: Property
type: DatatypeProperty
comment: Links to a string value read from a physical security marking.
domain: Authenticity Details
range: string
term status: stable
equivalent property: authenticitySecurityFeatureValue

Availability Ends
type: Property
type: DatatypeProperty
comment: The date from which the product is no longer available from the information provider, including seasonal or temporary product and services .
domain: Offer
range: dateTime
term status: stable
equivalent property: availabilityEnds

Availability Starts
type: DatatypeProperty
type: Property
comment: The date from which the product is available from the information provider, including seasonal or temporary product and services.
domain: Offer
range: dateTime
term status: stable
equivalent property: availabilityStarts

Available At/From
type: ObjectProperty
type: Property
comment: The location the offered product or service is available from.
domain: Offer
range: Place
term status: stable
equivalent property: availableAtOrFrom

Available Language
type: DatatypeProperty
type: Property
comment: ISO 639-1 code specifying the language of a specified contact point.
domain: Contact
range: string
sub property of: availableLanguage
related: ContactPoint
term status: stable
equivalent property: availableLanguage

Has Award Prize
type: ObjectProperty
type: Property
comment: An award or prize given to the product.
domain: Product
range: Award Prize
term status: stable
equivalent property: awardPrize

Award Prize Code
type: Property
type: DatatypeProperty
comment: Indicates the achievement of the product in relation to a prize or award, e.g. winner, runner-up, shortlisted.
domain: Award Prize
range: string
term status: stable
equivalent property: awardPrizeCode

Award Prize Country Code
type: Property
type: ObjectProperty
comment: An ISO standard code identifying the country in which a prize or award is given. It is recommended to populate this property with an ISO 3166-1 country code.
domain: Award Prize
range: Country
term status: stable
equivalent property: awardPrizeCountryCode

Award Prize Description
type: DatatypeProperty
type: Property
comment: Text that describes the awards won.
domain: Award Prize
range: langString
term status: stable
equivalent property: awardPrizeDescription

Award Prize Jury
type: Property
type: DatatypeProperty
comment: Free text listing members of the jury that awarded the prize.
domain: Award Prize
range: langString
term status: stable
equivalent property: awardPrizeJury

Award Prize Name
type: Property
type: DatatypeProperty
comment: The name of a prize or award which the product has received.
domain: Award Prize
range: langString
term status: stable
equivalent property: awardPrizeName

Award Prize Year
type: DatatypeProperty
type: Property
comment: The year in which a prize or award was given.
domain: Award Prize
range: gYear
term status: stable
equivalent property: awardPrizeYear

Background Information
type: Property
type: ObjectProperty
comment: A link to information typically from the owner of the identified entity about the creative background, thought leadership or influence of the identified entity. This may include the inspiration, innovation for a development process, literary approach or, the science or technology used.
domain: Thing
range: anyURI
sub property of: Link Type
term status: stable
equivalent property: backgroundInfo

Base Location
type: Property
type: ObjectProperty
comment: A fixed physical location where a mobile location most commonly resides. If gs1:glnType is present, gs1:baseLocationGLN SHALL only be used when gs1:glnType is gs1:GLN_TypeCode-MOBILE_PHYSICAL_LOCATION
domain: Place
range: Place
term status: stable
equivalent property: baseLocation

15
type: ObjectProperty
type: Property
comment: Best before date on the label or package signifies the end of the period under which the product will retain specific quality attributes or claims even though the product may continue to retain positive quality attributes after this date. Best before date is primarily used for consumer information and may be a regulatory requirement.
domain: Product
label: Best Before Date
range: date
notation: 15
term status: stable
equivalent property: bestBeforeDate

Beverage Vintage
type: DatatypeProperty
type: Property
comment: The year in which the majority of ingredients are harvested and/or the alcoholic beverage is produced. Determination as to whether the vintage year is the harvest date or production date is according to requirements in the Target Market.
domain: Beverage
range: string
term status: stable
equivalent property: beverageVintage

Biotin Per Nutrient Basis Quantity
type: Property
type: ObjectProperty
comment: Biotin Acid per specified nutrient basis quantity.
domain: Food Beverage Tobacco Product
range: Nutrition Measurement Type
term status: stable
equivalent property: biotinPerNutrientBasis

Boneless Claim
type: Property
type: ObjectProperty
comment: The descriptive term that is used by the product manufacturer to identify whether the product makes a specific claim to contain no bones.
domain: Meat Poultry
range: Nonbinary Logic Code
term status: stable
equivalent property: bonelessClaim

Has Brand
type: Property
type: ObjectProperty
comment: The brand of the product that appears on the consumer package.
domain: Product
range: Brand
sub property of: brand
term status: stable
equivalent property: brand

Information for professionals about this brand
type: Property
type: ObjectProperty
comment: A link to a brand presence aimed at clinical professionals.
domain: Thing
range: anyURI
sub property of: Link Type
term status: stable
equivalent property: brandHomepageClinical

Information for patients about this brand
type: Property
type: ObjectProperty
comment: A link to a brand presence aimed at patients.
domain: Thing
range: anyURI
sub property of: Link Type
term status: stable
equivalent property: brandHomepagePatient

Brand Name
type: Property
type: DatatypeProperty
comment: The brand name of the product that appears on the consumer package.
domain: Brand
range: langString
sub property of: name
related: Brand
term status: stable
equivalent property: brandName

Has Brand Owner
type: Property
type: ObjectProperty
comment: The brand owner of the product. The organization that is responsible for allocating the GTIN to the product.
domain: Product
range: Organization
sub property of: brand
term status: stable
equivalent property: brandOwner

Has Business Entity
type: ObjectProperty
type: Property
comment: Method for noting business structure (e.g., Limited liability company, not for profit). Expects a repeatable value from gs1:BusinessEntityType code list.
domain: Organization
range: Business Entity Type
term status: stable
equivalent property: businessEntity

Calcium Per Nutrient Basis Quantity
type: Property
type: ObjectProperty
comment: Calcium per specified nutrient basis quantity.
domain: Food Beverage Tobacco Product
range: Nutrition Measurement Type
term status: stable
equivalent property: calciumPerNutrientBasis

Carbohydrates Per Nutrient Basis Quantity
type: ObjectProperty
type: Property
comment: Carbohydrates per specified nutrient basis quantity.
domain: Food Beverage Tobacco Product
range: Nutrition Measurement Type
term status: stable
equivalent property: carbohydratesPerNutrientBasis

Careers information
type: Property
type: ObjectProperty
comment: A link to information about jobs, careers, or other employment opportunities associated to an organisation or location.
domain: Thing
range: anyURI
sub property of: Link Type
term status: stable
equivalent property: careersInfo

Catch Zone
type: Property
type: DatatypeProperty
comment: Free text field describing the sea zone from which the product was caught in.
domain: Seafood
range: langString
term status: stable
equivalent property: catchZone

Has Certification
type: Property
type: ObjectProperty
comment: Certification information about a product, organisation or location.
domain: Class
  union of: Product
  union of: Organization
  union of: Place
range: Certification
term status: stable
equivalent property: certification

Certification Agency
type: Property
type: DatatypeProperty
comment: Name of the organisation issuing the certification standard or other requirement being met .
domain: Certification
range: langString
term status: stable
equivalent property: certificationAgency

Certification Agency URL
type: Property
type: ObjectProperty
comment: URL of the organisation issuing the certification standard or other requirement being met. e.g. https://www.msc.org , https://www.fsc.org
domain: Certification
range: Organization
term status: stable
equivalent property: certificationAgencyURL

Certification Audit Date
type: DatatypeProperty
type: Property
comment: Date of completion of the auditing needed for certification
domain: Certification
range: date
term status: stable
equivalent property: certificationAuditDate

Certification End Date
type: DatatypeProperty
type: Property
comment: Last date of validity for the certification. (After this date the certification lapses and would need to be renewed/replaced)
domain: Certification
range: date
term status: stable
equivalent property: certificationEndDate

Certification Identification
type: DatatypeProperty
type: Property
comment: A reference (i.e, to a certificate instance) issued to confirm that a product, party or location has passed certification. e.g. 'XSC-C-12345'
domain: Certification
range: string
term status: stable
equivalent property: certificationIdentification

Certification Information
type: Property
type: ObjectProperty
comment: A link to certification information.
domain: Thing
range: anyURI
sub property of: Link Type
term status: stable
equivalent property: certificationInfo

Certification Standard
type: DatatypeProperty
type: Property
comment: Name of the certification standard. Free text. Example: 'Egg classification' .
domain: Certification
range: langString
term status: stable
equivalent property: certificationStandard

Certification Start Date
type: DatatypeProperty
type: Property
comment: First date of validity for the certification
domain: Certification
range: date
term status: stable
equivalent property: certificationStartDate

Certification Statement
type: DatatypeProperty
type: Property
comment: Certification scope statement of the individual certification instance. The same certificationStandard can be issued with different values of certificationStatement in different instances.
domain: Certification
range: langString
term status: stable
equivalent property: certificationStatement

Certification Status
type: ObjectProperty
type: Property
comment: Indicates the current status of the certification, e.g. active or inactive.
domain: Certification
range: Certification Status Code
term status: stable
equivalent property: certificationStatus

Certification Subject
type: ObjectProperty
type: Property
comment: References the object (e.g. product, asset, container), party or location being certified. If multiple values are specified, the certification details apply to the logical conjunction (AND) of groups of different types, while a logical disjunction (OR) applies within each group of the same type. For example, two sibling organisations O1 and O2 can process products P1 and P2 at locations L1 and L2: meaning that either organisation can process either product at either location (OR); but the certificate holds for the combinations of organisation (either O1 OR O2) AND product (either P1 OR P2) AND location (either L1 OR L2)
domain: Certification
range: Thing
term status: stable
equivalent property: certificationSubject

Certification Type
type: ObjectProperty
type: Property
comment: Indicates the type of certification
domain: Certification
range: Thing
term status: stable
equivalent property: certificationType

Certification URI
type: DatatypeProperty
type: Property
comment: If gs1:certificationURI is present, it should point to data about this individual certificate within a repository maintained by the certification agency.
domain: Certification
range: anyURI
term status: stable
equivalent property: certificationURI

Certification Value
type: DatatypeProperty
type: Property
comment: The certification's standard value. Example: '4'.
domain: Certification
range: langString
term status: stable
equivalent property: certificationValue

Cheese Firmness
type: Property
type: ObjectProperty
comment: The firmness of the cheese product for example EXTRA_HARD.
domain: Milk Butter Cream Yogurt Cheese Eggs Substitutes
range: Cheese Firmness Code
term status: stable
equivalent property: cheeseFirmness

Cheese Maturation Period Description
type: Property
type: DatatypeProperty
comment: A descriptive way to specify a date range as some cheeses are matured over a period of time, but not an exact period. For example 3 to 4 weeks, over 1 year etc. The term maturation is also known in other markets as Aged.
domain: Milk Butter Cream Yogurt Cheese Eggs Substitutes
range: langString
term status: stable
equivalent property: cheeseMaturationPeriodDescription

Chloride Per Nutrient Basis Quantity
type: ObjectProperty
type: Property
comment: Chloride per specified nutrient basis quantity.
domain: Food Beverage Tobacco Product
range: Nutrition Measurement Type
term status: stable
equivalent property: chloridePerNutrientBasis

Cholesterol Per Nutrient Basis Quantity
type: ObjectProperty
type: Property
comment: Cholesterol per specified nutrient basis quantity.
domain: Food Beverage Tobacco Product
range: Nutrition Measurement Type
term status: stable
equivalent property: cholesterolPerNutrientBasis

Chromium Per Nutrient Basis Quantity
type: Property
type: ObjectProperty
comment: Chromium per specified nutrient basis quantity.
domain: Food Beverage Tobacco Product
range: Nutrition Measurement Type
term status: stable
equivalent property: chromiumPerNutrientBasis

Circle
type: DatatypeProperty
type: Property
comment: A circle is the circular region of a specified radius centred at a specified latitude and longitude. A circle is expressed as a pair followed by a radius in meters.
domain: GeoShape
range: string
term status: stable
equivalent property: circle

Clothing Cut
type: Property
type: DatatypeProperty
comment: Supplemental information to indicate the clothing cut or silhouette make of the garment. For example, silhouette details for a pair of jeans such as boot cut, or loose fit, comfort fit.
domain: Clothing
range: langString
term status: stable
equivalent property: clothingCut

Collar Type
type: DatatypeProperty
type: Property
comment: A free text description of the type of collar on the garment.
domain: Clothing
range: langString
term status: stable
equivalent property: collarType

Has Colour Code
type: ObjectProperty
type: Property
comment: Relates to a set of details about the colour code for a product
domain: Product
range: Colour Code Details
term status: stable
equivalent property: colourCode

Colour Code List
type: Property
type: ObjectProperty
type: FunctionalProperty
comment: The parties controlling the colour code lists. Dependent on colour code value.
domain: Colour Code Details
range: Colour Code List Code
term status: stable
equivalent property: colourCodeList

Colour Code
type: Property
type: DatatypeProperty
type: FunctionalProperty
comment: A code indicating the colour of an object according to a specific code list. The applied code list is specified as additional information together with the colour code.
domain: Colour Code Details
range: string
term status: stable
equivalent property: colourCodeValue

Colour Description
type: FunctionalProperty
type: DatatypeProperty
type: Property
comment: A description of the colour of an object.
domain: Product
range: langString
related: Product
term status: stable
equivalent property: colourDescription

Company Filing URL
type: Property
type: DatatypeProperty
comment: A URI value linking to information related to organisation filing details.
domain: Organization
range: anyURI
term status: stable

Compulsory Additional Information
type: ObjectProperty
type: Property
comment: The legally required/compulsory additional label information as stated on the product packaging or label.
domain: Product
range: Compulsory Additional Information
term status: stable
equivalent property: compulsoryAdditionalInformation

Compulsory Additional Label Information
type: ObjectProperty
type: Property
comment: The legally required/compulsory additional label information as stated on the product packaging or label.
domain: Compulsory Additional Information
range: langString
term status: stable
equivalent property: compulsoryAdditionalLabelInformation

Compulsory Additional Label Information Type
type: ObjectProperty
type: Property
comment: The code indicating the type of the legally required/compulsory additional information that is stated on the product packaging label.
domain: Compulsory Additional Information
range: Compulsory Additional Label Information Type Code
term status: stable
equivalent property: compulsoryAdditionalLabelInformationType

Consumer First Availability Date Time
type: FunctionalProperty
type: DatatypeProperty
type: Property
comment: The first date/time that the buyer is allowed to sell the product to consumers. Usually related to a specific geography. ISO 8601 date format CCYY-MM-DDTHH:MM:SS.
domain: Target Market Details
range: dateTime
term status: stable
equivalent property: consumerFirstAvailabilityDateTime

Has Consumer Handling Storage
type: Property
type: ObjectProperty
comment: Link to a website, file, or image containing the manufacturer's recommendations for how the consumer or end user should store and handle the product.
domain: Product
range: Referenced File
term status: stable
equivalent property: consumerHandlingStorage

Consumer handling and storage information
type: Property
type: ObjectProperty
comment: A link to information about safe handling and storage for consumer use.
domain: Thing
range: anyURI
sub property of: Link Type
term status: stable
equivalent property: consumerHandlingStorageInfo

Consumer Lifestage
type: ObjectProperty
type: Property
comment: Indicates, with reference to the product branding, labelling or packaging, the descriptive term that is used by the product manufacturer to identify the period or stage in the consumer's life during which the product is considered to be suitable.
domain: Wearable Product
range: Consumer Lifestage Code
term status: stable
equivalent property: consumerLifestage

Consumer Package Disclaimer
type: DatatypeProperty
type: FunctionalProperty
type: Property
comment: Additional information that should be used in advertising and in displaying.
domain: Product
range: langString
term status: stable
equivalent property: consumerPackageDisclaimer

22
type: Property
type: ObjectProperty
comment: The consumer product variant may be used to distinguish one variant of a retail consumer trade item from another if the change does not require the allocation of a different Global Trade Item Number (per the GTIN Management Standard), but communication between trading partners is required to support consumers. The brand owner is responsible for assigning the consumer product variant.
domain: Product
label: Consumer Product Variant
range: string
notation: 22
term status: stable
equivalent property: consumerProductVariant

Consumer Recycling Instructions
type: Property
type: FunctionalProperty
type: DatatypeProperty
comment: Expresses in text the consumer recycling instructions which are normally held on the label or accompanying the product. Instructions may refer to the 'how' the consumer is supposed to sort the product and packaging materials for recycling.
domain: Product
range: langString
term status: stable
equivalent property: consumerRecyclingInstructions

Consumer Safety Information
type: Property
type: FunctionalProperty
type: DatatypeProperty
comment: Information on consumer safety regarding the product.
domain: Product
range: langString
term status: stable
equivalent property: consumerSafetyInformation

Consumer Sales Condition Code
type: ObjectProperty
type: Property
comment: A code indicating restrictions imposed on the product regarding how it can be sold to the consumer for example Prescription Required.
domain: Product
range: Consumer Sales Conditions Code
term status: stable
equivalent property: consumerSalesCondition

Consumer Storage Instructions
type: FunctionalProperty
type: Property
type: DatatypeProperty
comment: Expresses in text the consumer storage instructions of a product which are normally held on the label or accompanying the product. This information may or may not be labelled on the pack.
domain: Product
range: langString
term status: stable
equivalent property: consumerStorageInstructions

Consumer Usage Instructions
type: Property
type: FunctionalProperty
type: DatatypeProperty
comment: Free text containing the usage instructions of a product, which are normally held on the label or accompanying the product. This information may or may not be labelled on the pack.
domain: Product
range: langString
term status: stable
equivalent property: consumerUsageInstructions

Has Business Contact
type: Property
type: ObjectProperty
comment: Contact information. To specify a contact specifically designated for after-hours support, see gs1:afterHoursContact
domain: Class
range: Contact
sub property of: contactPoint
term status: stable
equivalent property: contactPoint

Has Contact Role Code
type: Property
type: ObjectProperty
comment: The function or role of a contact. Value from gs1:ContactRoleType code list.
domain: Contact
range: Contact Role Type
term status: stable
equivalent property: contactRoleCode

Contact Title
type: Property
type: DatatypeProperty
comment: The job title of the person that can be contacted for example Manager.
domain: Contact
range: langString
related: Person
term status: stable
equivalent property: contactTitle

Contact Type
type: Property
type: DatatypeProperty
comment: The function or role of a contact for example Customer Support.
domain: Contact
range: langString
term status: stable
equivalent property: contactType

Contained in Place
type: Property
type: ObjectProperty
comment: Designates the larger physical location a sub-location is located within. To specify sub-locations of a physical location, see gs1:containsPlace.
domain: Place
range: Place
term status: stable
equivalent property: containedInPlace

Contains Place
type: Property
type: ObjectProperty
comment: Designates a sub-location (e.g., floor, room, shelf) within the physical location being identified. There may be multiple sub-locations associated to a single, physical location. To specify the larger physical location the sub-location is located within, see gs1:containedInPlace
domain: Place
range: Place
term status: stable
equivalent property: containsPlace

Convenience Level Percent
type: Property
type: DatatypeProperty
comment: An indication of the ease of preparation for semi-prepared products. The convenience level indicates the level of preparation in percentage required to prepare and helps the consumer to assess how long it will take to prepare the meal.
domain: Food and Beverage Preparation Information
range: float
term status: stable
equivalent property: convenienceLevelPercent

Coordinate Reference System
type: DatatypeProperty
type: Property
comment: Open standard spatial reference systems or coordinate reference systems that provide coordinate-based local, regional or global system used to locate geographical entities. Values should be URIs already defined by the IOPG Geomatics Committee (https://epsg.org/), such as https://epsg.io/4326 (WGS84); https://epsg.io/4267 (NAD27); https://epsg.io/4230 (ED50); https://epsg.io/4618 (SAD69); https://epsg.io/4269 (NAD83). For elevation values, gs1:elevation SHALL be used.
domain: GeoCoordinates
range: anyURI
term status: stable
equivalent property: coordinateReferenceSystem

Copper Per Nutrient Basis Quantity
type: ObjectProperty
type: Property
comment: Copper per specified nutrient basis quantity.
domain: Food Beverage Tobacco Product
range: Nutrition Measurement Type
term status: stable
equivalent property: copperPerNutrientBasis

Country Code
type: DatatypeProperty
type: Property
comment: Code specifying the country for the address using ISO 3166-1.
comment: A short text string code (see values defined in ISO 3166) specifying the country in which a processing or other activity is performed, for example processing, bottling, manufacturing.
domain: Country
range: string
related: PostalAddress
term status: stable
equivalent property: countryCode

Has Country Of Assembly
type: ObjectProperty
type: Property
comment: The place where product is assembled.
domain: Product
range: Country
term status: stable
equivalent property: countryOfAssembly

Has Country Of Last Processing
type: Property
type: ObjectProperty
comment: The place where the product or ingredient was last processed and tested before importation.
domain: Product
range: Country
term status: stable
equivalent property: countryOfLastProcessing

Has Country Of Origin
type: Property
type: ObjectProperty
comment: Code indicating the country of origin of the product.
domain: Product
range: Country
term status: stable
equivalent property: countryOfOrigin

Country Of Origin Statement
type: FunctionalProperty
type: Property
type: DatatypeProperty
comment: A description of the geographic area the item may have originated from or has been processed.
domain: Product
range: langString
term status: stable
equivalent property: countryOfOriginStatement

Country Subdivision Code
type: Property
type: DatatypeProperty
comment: A short text string code (see values defined in ISO 3166_2) specifying the country subdivision in which an activity is performed, for example processing, bottling, manufacturing.
domain: Country
range: string
term status: stable
equivalent property: countrySubdivisionCode

County Code
type: Property
type: DatatypeProperty
comment: A code that identifies a county. A county is a territorial division in some countries, forming the chief unit of local administration. In the US, a county is a political and administrative division of a state.
domain: Address
range: string
term status: stable
equivalent property: countyCode

Cross Street
type: DatatypeProperty
type: Property
comment: A street intersecting a main street (usually at right angles) and continuing on both sides of it.
domain: Address
range: langString
term status: stable
equivalent property: crossStreet

Corporate Social Responsibility Affiliation
type: Property
type: DatatypeProperty
comment: A URI value linking to information related to social responsibility activities and associations that an organisation/party is involved with.
domain: Organization
range: anyURI
term status: stable

Has Customer Support Centre
type: Property
type: ObjectProperty
comment: The organization which provides product support to the trading partner organization to which merchandise is sold.
domain: Product
range: Organization
term status: stable
equivalent property: customerSupportCentre

Daily Value Intake Percent
type: Property
type: DatatypeProperty
comment: The percentage of the recommended daily intake of a nutrient as recommended by authorities of the target market. Is expressed relative to the serving size and base daily value intake.
domain: Nutrition Measurement Type
range: float
equivalent property: dailyValueIntakePercent

Default link
type: Property
type: ObjectProperty
comment: The default link for a given identified item to which a resolver will redirect unless there is information in the request that is a better match.
domain: Thing
range: anyURI
sub property of: Link Type
term status: stable
restricted: resolver
equivalent property: defaultLink

Default linkMulti
type: Property
type: ObjectProperty
comment: A set of 'default links' that may be differentiated by information in the HTTP request headers sent to a resolver to enable a better match than the single default link.
domain: Thing
range: anyURI
sub property of: Link Type
term status: stable
restricted: resolver
equivalent property: defaultLinkMulti

Department
type: DatatypeProperty
type: Property
comment: The name of a division of an organization dealing with a specific activity
domain: Organization
range: langString
term status: stable
equivalent property: department

Has Dependent Proprietary Product
type: ObjectProperty
type: Property
comment: Dependent products are products which are required to make the current product functional.
domain: Product
range: Product
broad match: isSimilarTo
term status: stable
equivalent property: dependentProprietaryProduct

Descriptive Size
type: DatatypeProperty
type: FunctionalProperty
type: Property
comment: An alphanumeric size factor the brand owner wishes to communicate to the consumer. IE Jumbo, Capri, Full Length, Maxi.
domain: Product
range: langString
term status: stable
equivalent property: descriptiveSize

Diet Code
type: DatatypeProperty
type: Property
comment: Links to multiple pairs of gs1:DietTypeCode and diet type sub code (free-form text string).
domain: Food Beverage Tobacco Product
range: Diet Type Code Details
term status: stable
equivalent property: dietCode

Diet Type Code
type: Property
type: ObjectProperty
comment: Code indicating the diet the product is suitable for example Kosher.
domain: Diet Type Code Details
range: Diet Type Code
term status: stable
equivalent property: dietType

Diet Type Description
type: Property
type: DatatypeProperty
comment: Free text for indication of diet not stated in the list of diets.
domain: Food Beverage Tobacco Product
range: langString
term status: stable
equivalent property: dietTypeDescription

Diet Type Sub-code
type: Property
type: DatatypeProperty
comment: Indicates a set of agreements or a certificate name that guarantees the product is permitted in a particular diet. A diet type subcode is a subclassification of a specific diet type. For example, Pareve is a diet type subcode of Kosher.
domain: Diet Type Code Details
range: langString
term status: stable
equivalent property: dietTypeSubcode

Has Digital Address
type: Property
type: DatatypeProperty
comment: The location reference associated to a digital place. If gs1:glnType is present, SHALL only be associated if the value of gs1:glnType is gs1:GLN_TypeCode-DIGITAL_LOCATION.
domain: Place
range: string
term status: stable
equivalent property: digitalAddress

Digital Location Name
type: Property
type: DatatypeProperty
comment: The name of a digital place. To specify the name of a physical location, see gs1:physicalLocationName.
domain: Place
range: langString
term status: stable
equivalent property: digitalLocationName

Discount Repeats Per Multiple Minimum
type: Property
type: DatatypeProperty
comment: If specified and set to true, the discount is available for each time the minimum qualifying criteria are met. This can be used to express '$10 off each $50 spend', which is distinct from a 20% discount because it is quantized in units of spending.
domain: Discount
range: boolean
term status: stable
equivalent property: discountRepeatsPerMultipleMinimum

Discount Type
type: DatatypeProperty
type: Property
comment: A code that specifies the type of payment discount applicable to an offer, for example BOGO.
domain: Discount
range: Discount Type Code
term status: stable
equivalent property: discountType

Digital Product Passport
type: Property
type: ObjectProperty
comment: A link to a digital product passport.
domain: Thing
range: anyURI
sub property of: Link Type
term status: stable

Drained Weight
type: ObjectProperty
type: Property
type: FunctionalProperty
comment: The weight of the product when drained of its liquid. For example 225 GRM, Jar of pickles in vinegar.
domain: Food Beverage Tobacco Product
range: Measurement Type
sub property of: weight
term status: stable
equivalent property: drainedWeight

12
type: ObjectProperty
type: Property
comment: The date by which an invoice should be paid. This data element represents an attribute of a payment slip reference number, AI (8020), and a Global Location Number (GLN) of the invoicing party.
domain: Product
label: Due Date
range: date
notation: 12
term status: stable
equivalent property: dueDate

Duration Of Warranty
type: Property
type: ObjectProperty
comment: The time period that the warranty is valid within.
domain: Warranty
range: Measurement Type
term status: stable
equivalent property: durationOfWarranty

Duty Fee Tax Amount
type: DatatypeProperty
type: Property
comment: The current tax or duty or fee amount applicable to the product, expressed as a floating-point numeric value that is qualified by the corresponding currency. See also gs1:priceCurrency.
domain: Price Specification
range: float
term status: stable
equivalent property: dutyFeeTaxAmount

Duty Fee Tax Description
type: Property
type: DatatypeProperty
comment: A description of tax type for example Taxes sure les supports audio.
domain: Price Specification
range: langString
term status: stable
equivalent property: dutyFeeTaxDescription

Duty Fee Tax Rate
type: Property
type: DatatypeProperty
comment: The current tax or duty rate percentage applicable to the product.
domain: Price Specification
range: float
term status: stable
equivalent property: dutyFeeTaxRate

Electronic Instructions For Use
type: Property
type: ObjectProperty
comment: A link to electronic Instruction For Use instructions for Medical Devices.
domain: Thing
range: anyURI
sub property of: Link Type
term status: stable
restricted: validatedHealthcare
equivalent property: eifu

Elevation
type: DatatypeProperty
type: Property
comment: The elevation of a location (WGS 84). Values may be of the form 'NUMBER UNITOFMEASUREMENT' (e.g., '1,000 m', '3,200 ft') while numbers alone SHALL be a value in meters.
domain: GeoCoordinates
range: string
term status: stable
equivalent property: elevation

Eligible Quantity
type: ObjectProperty
type: Property
comment: The quantity including unit of measure for which the offer for good or service is valid. If this is not specified, an eligible quantity of 1 should be assumed.
domain: Class
range: Measurement Type
sub property of: eligibleQuantity
term status: stable
equivalent property: eligibleQuantity

Eligible Quantity Maximum
type: ObjectProperty
type: Property
comment: The maximum quantity including unit of measure for which the offer for good or service is valid.
domain: Class
range: Measurement Type
sub property of: eligibleQuantity
broad match: eligibleQuantity
term status: stable
equivalent property: eligibleQuantityMaximum

Eligible Quantity Minimum
type: Property
type: ObjectProperty
comment: The minimum quantity including unit of measure for which the offer for good or service is valid.
domain: Class
range: Measurement Type
sub property of: eligibleQuantity
broad match: eligibleQuantity
term status: stable
equivalent property: eligibleQuantityMinimum

Eligible Trade Channel
type: DatatypeProperty
type: Property
comment: A code determining the location where a user can redeem the offer, for example ONLINE_ONLY.
domain: Discount
range: Trade Channel Code
term status: stable
equivalent property: eligibleTradeChannel

E-mail
type: DatatypeProperty
type: Property
comment: Creating/sending/receiving of unstructured free text messages or documents using computer network, a mini-computer or an attached modem and regular telephone line or other electronic transmission media.
domain: Contact
range: string
term status: stable
equivalent property: email

Energy from Fat Per Nutrient Basis Quantity
type: ObjectProperty
type: Property
comment: Energy from Fat per specified nutrient basis quantity.
domain: Food Beverage Tobacco Product
range: Nutrition Measurement Type
term status: stable
equivalent property: energyFromFatPerNutrientBasis

Energy Per Nutrient Basis Quantity
type: Property
type: ObjectProperty
comment: Energy Per specified nutrient basis quantity.
domain: Food Beverage Tobacco Product
range: Nutrition Measurement Type
term status: stable
equivalent property: energyPerNutrientBasis

EPC Information Services (EPCIS) repository
type: Property
type: ObjectProperty
comment: A link to an EPCIS repository of visibility event data.
domain: Thing
range: anyURI
sub property of: Link Type
term status: stable
equivalent property: epcis

Electronic Patient Information Leaflet
type: Property
type: ObjectProperty
comment: A link to an electronic patient information leaflet.
domain: Thing
range: anyURI
sub property of: Link Type
term status: stable
restricted: validatedHealthcare
equivalent property: epil

Has Equivalent Product
type: Property
type: ObjectProperty
comment: A product which can be substituted for the product based on supplier-defined functional equivalence to the product.
domain: Product
range: Product
sub property of: isSimilarTo
term status: stable
equivalent property: equivalentProduct

Events information
type: Property
type: ObjectProperty
comment: A link to event details. For a page specifically for scheduling a reservation or booking an appointment, see gs1:scheduleTime.
domain: Thing
range: anyURI
sub property of: Link Type
term status: stable
equivalent property: eventsInfo

Exact Discount Amount
type: Property
type: DatatypeProperty
comment: Links to a gs1:PriceSpecification that indicates in terms of an amount and specified currency, the exact discount on the sales price associated with a particular gs1:Discount. This property can be used to express '$10 off'.
domain: Discount
range: Price Specification
term status: stable
equivalent property: exactDiscountAmount

Exact Discount Percentage
type: DatatypeProperty
type: Property
comment: A floating-point value indicating an exact percentage discount on the sales price associated with a particular gs1:Discount. This property can be used to express '15% discount'.
domain: Discount
range: float
term status: stable
equivalent property: exactDiscountPercentage

Exclusion Description
type: ObjectProperty
type: Property
comment: A text description of any products, brands, or categories that cannot be used with the offer
domain: Discount
range: langString
term status: stable
equivalent property: exclusionDescription

17
type: ObjectProperty
type: Property
comment: The expiration date is the date that determines the limit of consumption or use of a product/coupon. Its meaning is determined based on the trade item context (e.g., for food, the date will indicate the possibility of a direct health risk resulting from use of the product after the date, for pharmaceutical products, it will indicate the possibility of an indirect health risk resulting from the ineffectiveness of the product after the date). It is often referred to as 'use by date' or 'maximum durability date'.
domain: Product
label: Expiration Date
range: date
notation: 17
term status: stable
equivalent property: expirationDate

7003
type: ObjectProperty
type: Property
comment: The manufacturer determines the expiration date and time, which is relevant only for short duration and for items that will not be sent on long distances and not outside of the time zone. A typical application of AI (7003) is in hospitals or public pharmacies for special, customised, products which may have a 'life duration' shorter than one single day. The life duration varies according the pharmaceutical substances used in the treatment. The precise expiration date and time is defined at the end of the manufacturing process, and can be barcoded on the product label as an attribute to the item's GTIN. Where there is no business requirement to express the expiration date to the nearest hour (or less), AI (17) Expiration date should be used.
domain: Product
label: Expiration Date and Time
range: dateTime
notation: 7003
term status: stable
equivalent property: expirationDateTime

Frequently Asked Questions
type: Property
type: ObjectProperty
comment: A link to a set of frequently asked questions.
domain: Thing
range: anyURI
sub property of: Link Type
term status: stable
equivalent property: faqs

Fat In Milk Content
type: DatatypeProperty
type: Property
comment: The percentage of fat contained in milk content of the product.
domain: Milk Butter Cream Yogurt Cheese Eggs Substitutes
range: float
term status: stable
equivalent property: fatInMilkContent

Fat Per Nutrient Basis Quantity
type: Property
type: ObjectProperty
comment: Fat per specified nutrient basis quantity.
domain: Food Beverage Tobacco Product
range: Nutrition Measurement Type
term status: stable
equivalent property: fatPerNutrientBasis

Fat In Dry Matter
type: Property
type: DatatypeProperty
comment: The amount of fat contained in the base product expressed in percentage.
domain: Milk Butter Cream Yogurt Cheese Eggs Substitutes
range: float
term status: stable
equivalent property: fatpercentageInDryMatter

Telefax
type: Property
type: DatatypeProperty
comment: A fax number used for transmitting and reproducing fixed graphic material over telephone lines or other electronic transmission media.
domain: Contact
range: string
term status: stable
equivalent property: faxNumber

Fibre Per Nutrient Basis Quantity
type: Property
type: ObjectProperty
comment: Fibre per specified nutrient basis quantity.
domain: Food Beverage Tobacco Product
range: Nutrition Measurement Type
term status: stable
equivalent property: fibrePerNutrientBasis

File Language Code
type: DatatypeProperty
type: Property
comment: The specified language to which the digital asset is targeted. It is recommended to use the ISO 639-1 language code.
domain: Referenced File
range: string
sub property of: inLanguage
related: CreativeWork
term status: stable
equivalent property: fileLanguageCode

File Pixel Height
type: DatatypeProperty
type: Property
comment: The number of pixels along the vertical axis of the image.
domain: Referenced File
range: integer
sub property of: height
related: MediaObject
term status: stable
equivalent property: filePixelHeight

File Pixel Width
type: DatatypeProperty
type: Property
comment: The number of pixels along the horizontal axis of the image.
domain: Referenced File
range: integer
sub property of: width
related: MediaObject
term status: stable
equivalent property: filePixelWidth

7006
type: ObjectProperty
type: Property
comment: The first freeze date is applicable to products that are frozen directly after slaughtering, harvesting, catching or after initial processing of the product. Examples include fresh meat, meat products or fishery products. The first freeze date is determined by the organisation conducting the freezing.
domain: Product
label: First Freeze Date
range: date
notation: 7006
term status: stable
equivalent property: firstFreezeDate

Fish Type
type: Property
type: DatatypeProperty
comment: The type of fish for example Sea bass.
domain: Seafood
range: langString
term status: stable
equivalent property: fishType

Fluoride Per Nutrient Basis Quantity
type: Property
type: ObjectProperty
comment: Fluoride per specified nutrient basis quantity.
domain: Food Beverage Tobacco Product
range: Nutrition Measurement Type
term status: stable
equivalent property: fluoridePerNutrientBasis

Folic Acid Per Nutrient Basis Quantity
type: Property
type: ObjectProperty
comment: Folic Acid per specified nutrient basis quantity.
domain: Food Beverage Tobacco Product
range: Nutrition Measurement Type
term status: stable
equivalent property: folicAcidPerNutrientBasis

Food Beverage Refrigeration Claim
type: ObjectProperty
type: Property
comment: Identifies whether or not the product requires refrigeration.
domain: Food Beverage Tobacco Product
range: Food Beverage Refrigeration Claim Code
term status: stable
equivalent property: foodBeverageRefrigerationClaim

Food Beverage Target Use
type: ObjectProperty
type: Property
comment: The type of meal the food or beverage product is targeted to for example Breakfast.
domain: Food Beverage Tobacco Product
range: Food Beverage Target Use Code
term status: stable
equivalent property: foodBeverageTargetUse

Fastening Type
type: ObjectProperty
type: Property
comment: Something that mechanically joins or affixes two or more parts together in a footwear product for example a shoe lace.
domain: Footwear
range: Footwear Fastening Type Code
term status: stable
equivalent property: footwearFasteningType

Footwear Upper Type
type: Property
type: ObjectProperty
comment: The descriptive term that is used by the product manufacturer to identify whether the footwear upper is open or closed. Otherwise known as Open or Closed Upper.
domain: Footwear
range: Upper Type Code
term status: stable
equivalent property: footwearUpperType

Franchisee of
type: Property
type: ObjectProperty
comment: Method for associating the franchisor organisation to the franchisee.
domain: Organization
range: Organization
term status: stable

Franchisor of
type: Property
type: ObjectProperty
comment: Method for associating franchisee organisation(s) to the franchisor.
domain: Organization
range: Organization
term status: stable

Fresh or Seawater Farmed
type: ObjectProperty
type: Property
comment: A code determining whether the fish originated from the sea or was farmed.
domain: Seafood
range: Fresh Or Seawater Farmed Code
term status: stable
equivalent property: freshOrSeawaterFarmed

Functional Name
type: DatatypeProperty
type: FunctionalProperty
type: Property
comment: Describes use of the product or service by the consumer. Should help clarify the product classification associated with the GTIN.
domain: Product
range: langString
term status: stable
equivalent property: functionalName

Genetically Modified Declaration Code
type: Property
type: ObjectProperty
comment: A statement of the presence or absence of genetically modified protein or DNA.
domain: Food Beverage Tobacco Product
range: Level Of Containment Code
term status: stable
equivalent property: geneticallyModifiedDeclaration

Has Geocoordinates
type: Property
type: ObjectProperty
comment: Links to information about geocoordinates or geoshapes for a place.
domain: Place
range: Class
  union of: GeoCoordinates
  union of: GeoShape
term status: stable
equivalent property: geo

Has GLN Type
type: Property
type: ObjectProperty
comment: Indicates what type of thing is being identified by a GLN.
domain: Class
range: GLN Type Code
term status: stable
equivalent property: glnType

Global Location Number (GLN)
type: Property
type: DatatypeProperty
comment: A Global Location Number (GLN) is the GS1 Identification Key used to identify physical locations or parties. The key comprises a GS1 Company Prefix, Location Reference and Check Digit. For more information see https://www.gs1.org/gln.
domain: Class
range: string
term status: stable
equivalent property: globalLocationNumber

GPC Category Code
type: DatatypeProperty
type: FunctionalProperty
type: Property
comment: 8-digit code (GPC Brick Value) specifying a product category according to the GS1 Global Product Classification (GPC) standard. For more information see https://www.gs1.org/gpc
domain: Product
range: string
term status: stable
equivalent property: gpcCategoryCode

GPC Category Description
type: DatatypeProperty
type: FunctionalProperty
type: Property
comment: A description of the code specifying a product category according to the GS1 Global Product Classification (GPC) standard.
domain: Product
range: langString
term status: stable
equivalent property: gpcCategoryDescription

334n, 353n, 354n, 355n
type: Property
type: ObjectProperty
type: FunctionalProperty
comment: The overall area of the item including packaging. This can be given using a number of different AI ranges that depend on the units in which the area is measured.
domain: Product
label: Gross area
range: Measurement Type
term status: stable
equivalent property: grossArea

335n, 336n, 362n, 363n, 367n, 368n, 369n
type: FunctionalProperty
type: ObjectProperty
type: Property
comment: The overall volume of the item including packaging. This can be given using a number of different AI ranges that depend on the units in which the volume is measured.
domain: Product
label: Gross volume
range: Measurement Type
term status: stable
equivalent property: grossVolume

Gross Weight
type: FunctionalProperty
type: Property
type: ObjectProperty
comment: Used to identify the gross weight of the product. The gross weight includes all packaging materials of the product. At pallet level the productGrossWeight includes the weight of the pallet itself. For example, 200 GRM, value - total pounds, total grams, etc.
domain: Product
range: Measurement Type
sub property of: weight
term status: stable
equivalent property: grossWeight

Growing Method
type: Property
type: ObjectProperty
comment: The process through which fresh produce is grown and cultivated.
domain: Product
range: Growing Method Code
term status: stable
equivalent property: growingMethod

01
type: DatatypeProperty
type: FunctionalProperty
type: Property
comment: A Global Trade Item Number (GTIN) is the 14 digit GS1 Identification Key used to identify products. The key comprises a GS1 Company Prefix followed by an Item Reference Number and a Check Digit. See https://www.gs1.org/gtin for more details.
domain: Product
label: GTIN
range: string
notation: 01
term status: stable
equivalent property: gtin

Handled by
type: Property
type: ObjectProperty
comment: Used when one resolver redirects all request URIs that match a given pattern without further processing, such as from GS1 to a brand-operated service. See section 7.7.1 of the Digital Link standard, version 1.1.
domain: Thing
range: anyURI
sub property of: Link Type
term status: stable
restricted: resolver
equivalent property: handledBy

7007
type: ObjectProperty
type: Property
comment: The harvest date. For example, the harvest date can be the date when an animal was slaughtered or killed, a fish has been harvested, or a crop was harvested. This date is determined by the organisation conducting the harvesting. Different organisations may use more specific terminology when referring to their specific needs and use terms such as: Date of catch or slaughter date.
domain: Product
label: Harvest Date.
range: date
notation: 7007
term status: stable
equivalent property: harvestDate

7007
type: ObjectProperty
type: Property
comment: The harvest end date. For example, the harvest end date can be the date when an animal was slaughtered or killed, a fish has been harvested, or a crop was harvested. This end date is determined by the organisation conducting the harvesting. Different organisations may use more specific terminology when referring to their specific needs and use terms such as: Date of catch or slaughter date. When referring to animals the date range refers to the whole animal and all meat or fish cuts derived from this animal.
domain: Product
label: Harvest Date End
range: date
notation: 7007
term status: stable
equivalent property: harvestDateEnd

7007
type: ObjectProperty
type: Property
comment: The harvest start date. For example, the harvest start date can be the date when an animal was slaughtered or killed, a fish has been harvested, or a crop was harvested. This start date is determined by the organisation conducting the harvesting. Different organisations may use more specific terminology when referring to their specific needs and use terms such as: Date of catch or slaughter date. When referring to animals the date range refers to the whole animal and all meat or fish cuts derived from this animal.
domain: Product
label: Harvest Date Start
range: date
notation: 7007
term status: stable
equivalent property: harvestDateStart

Has Allergen
type: Property
type: ObjectProperty
comment: Relates to details about allergens
domain: Food Beverage Tobacco Product
range: Allergen Details
term status: stable
equivalent property: hasAllergen

10
type: Property
type: ObjectProperty
comment: The batch or lot number associates an item with information the manufacturer considers relevant for traceability of the trade item to which the element string is applied. The data may refer to the trade item itself or to items contained. The number may be, for example, a production lot number, a shift number, a machine number, a time, or an internal production code. In cases where the same product is manufactured in different locations the brand owner and the manufacturer are responsible for ensuring the non-duplication of batch/lot numbers for a GTIN. For the re-use of batch/lot numbers with a GTIN, sector-specific constraints need to be considered.
domain: Product
label: Batch/Lot Identifier
range: string
notation: 10
term status: stable
equivalent property: hasBatchLotNumber

Has primary location
type: ObjectProperty
type: Property
comment: Links to the place(s) that this organisation designates as their primary location(s).
domain: Organization
range: Place
term status: stable
equivalent property: hasPrimaryLocation

Has Retailers
type: Property
type: ObjectProperty
comment: A link to a list of retailers.
domain: Thing
range: anyURI
sub property of: Link Type
term status: stable
equivalent property: hasRetailers

Has Returnable Package Deposit Details
type: ObjectProperty
type: Property
comment: links to details of amounts refunded for returnable package in a specified region.
domain: Packaging
range: Returnable Package Deposit Details
term status: stable
equivalent property: hasReturnablePackageDeposit

21
type: Property
type: ObjectProperty
comment: A serial number is assigned to an entity for its lifetime. When combined with a GTIN, a serial number uniquely identifies an individual item. The serial number field is alphanumeric and may include all characters contained in figure 7.11-1. The brand owner and the manufacturer are responsible for ensuring the non-duplication of serial numbers for a GTIN. For the re-use of serial numbers with a GTIN, sector-specific constraints need to be considered.
domain: Product
label: Serial Number
range: string
notation: 21
term status: stable
equivalent property: hasSerialNumber

235
type: Property
type: ObjectProperty
comment: This identifier is assigned to an entity for its lifetime. When combined with a GTIN, a TPX uniquely identifies an individual item and forms a unit pack Unique Identifier (upUI) for tobacco traceability per EU 2018/574. The serial number field is alphanumeric and may include all characters contained in figure 7.11-1. The Third Party determines the TPX, but the TPX shall begin with the ID Issuer Unique Identification Code (UIC), followed by GS1 UIC Extension 1, and GS1 UIC Extension 2.
domain: Product
label: Third-Party Controlled Serial Number
range: string
notation: 235
term status: stable
equivalent property: hasThirdPartyControlledSerialNumber

Health Claim
type: DatatypeProperty
type: FunctionalProperty
type: Property
comment: A description of health claims according to regulations of the target market.
domain: Product
range: langString
term status: stable
equivalent property: healthClaimDescription

Organisation Information Page
type: Property
type: ObjectProperty
comment: A link to general information about an organisation or brand. Typically the homepage of an organisation's website. It may include links to further information such as certifications, careers, payments, reservations, etc.
domain: Thing
range: anyURI
sub property of: Link Type
term status: stable
equivalent property: homepage

Has Product Image
type: Property
type: ObjectProperty
comment: Link to a file containing a visual representation of the product.
domain: Product
range: Referenced File
term status: stable
equivalent property: image

In Package Depth
type: Property
type: ObjectProperty
comment: The depth of the product in its packaging, as measured according to the GS1 Package Measurement Rules. See https://www.gs1.org/package-measurement-rules-implementation-guide for more details.
domain: Product
range: Measurement Type
related: depth
term status: stable
equivalent property: inPackageDepth

In Package Diameter
type: ObjectProperty
type: Property
comment: The measurement of the diameter of the product in its package at its largest point. For example, 165 MMT.
domain: Product
range: Measurement Type
term status: stable
equivalent property: inPackageDiameter

In Package Height
type: Property
type: ObjectProperty
comment: The height of the product in the package, as measured according to the GS1 Package Measurement Rules. See https://www.gs1.org/package-measurement-rules-implementation-guide for more details.
domain: Product
range: Measurement Type
related: height
term status: stable
equivalent property: inPackageHeight

In Package Width
type: Property
type: ObjectProperty
comment: The width of the product in the package, as measured according to the GS1 Package Measurement Rules. See https://www.gs1.org/package-measurement-rules-implementation-guide for more details.
domain: Product
range: Measurement Type
related: width
term status: stable
equivalent property: inPackageWidth

Included Accessories
type: FunctionalProperty
type: Property
type: DatatypeProperty
comment: Any included object or device not part of the core product itself but which adds to its functionality or use.
domain: Product
range: langString
related: isAccessoryOrSparePartFor
term status: stable
equivalent property: includedAccessories

Has Food And Beverage Ingredient Information
type: Property
type: ObjectProperty
comment: Links to information about ingredients of a specific Food/Beverage/Tobacco product.
domain: Food Beverage Tobacco Product
range: Food Beverage Tobacco Ingredient
term status: stable
equivalent property: ingredient

Ingredient Content Percentage
type: DatatypeProperty
type: Property
comment: Quantity of the ingredient contained in the product as a percentage of the total product ingredients. This is used in conjunction with ingredientName.
domain: Food Beverage Tobacco Ingredient
range: float
term status: stable
equivalent property: ingredientContentPercentage

Ingredient Name
type: DatatypeProperty
type: Property
comment: Free text field describing an ingredient or ingredient group. Ingredients include any additives (colourings, preservatives, e-numbers, etc.) that are encompassed.
domain: Food Beverage Tobacco Ingredient
range: langString
term status: stable
equivalent property: ingredientName

Ingredient of Concern
type: Property
type: DatatypeProperty
comment: Indicates a claim to an ingredient, considered to be a concern for regulatory or other reasons, and which is 'contained' within the product but may not need to specify the amount whether approximate, or an accurate measurement be given.
domain: Food Beverage Tobacco Product
range: langString
term status: stable
equivalent property: ingredientOfConcern

Ingredient Sequence
type: DatatypeProperty
type: Property
comment: Integer (1, 2, 3...) indicating the ingredient order by content percentage of the product. (major ingredient = 1, second ingredient = 2) etc.
domain: Food Beverage Tobacco Ingredient
range: integer
term status: stable
equivalent property: ingredientSequence

Ingredient Statement
type: DatatypeProperty
type: Property
comment: Information on the constituent ingredient make up of the product specified as one string.
domain: Food Beverage Tobacco Product
range: langString
term status: stable
equivalent property: ingredientStatement

Ingredients information
type: Property
type: ObjectProperty
comment: A link to facts about ingredients.
domain: Thing
range: anyURI
sub property of: Link Type
term status: stable
equivalent property: ingredientsInfo

Initial Certification Date
type: DatatypeProperty
type: Property
comment: The date when the certification was originally issued. May differ from the certificationStartDate of the current recertification cycle.
domain: Certification
range: date
term status: stable
equivalent property: initialCertificationDate

Instructions
type: Property
type: ObjectProperty
comment: A link to instructions, such as assembly instructions, usage tips etc. It is not appropriate to use this link type for healthcare regulated content applications for which specific link types are available.
domain: Thing
range: anyURI
sub property of: Link Type
term status: stable
equivalent property: instructions

Has Instructions For Use
type: ObjectProperty
type: Property
comment: Link to a file containing the Instructions For Use.
domain: Product
range: Referenced File
term status: stable
equivalent property: instructionsForUse

Iodine Per Nutrient Basis Quantity
type: Property
type: ObjectProperty
comment: Iodine per specified nutrient basis quantity.
domain: Food Beverage Tobacco Product
range: Nutrition Measurement Type
term status: stable
equivalent property: iodinePerNutrientBasis

Iron Per Nutrient Basis Quantity
type: ObjectProperty
type: Property
comment: Iron per specified nutrient basis quantity.
domain: Food Beverage Tobacco Product
range: Nutrition Measurement Type
term status: stable
equivalent property: ironPerNutrientBasis

Irradiated Code
type: ObjectProperty
type: Property
comment: Indicates if radiation has been applied to the product.
domain: Food Beverage Tobacco Product
range: Nonbinary Logic Code
term status: stable
equivalent property: irradiatedCode

Is Carbonated
type: ObjectProperty
type: Property
comment: Used to identify whether or not a beverage product is naturally effervescent or has been made effervescent by the addition of carbon dioxide gas.
domain: Beverage
range: Nonbinary Logic Code
term status: stable
equivalent property: isCarbonated

Is Decaffeinated
type: ObjectProperty
type: Property
comment: The descriptive term that is used by the product manufacturer to identify whether or not the product contains caffeine.
domain: Beverage
range: Nonbinary Logic Code
term status: stable
equivalent property: isDecaffeinated

Is From Concentrate
type: ObjectProperty
type: Property
comment: Used to identify whether or not the product claims to be made from a concentrated formulation.
domain: Beverage
range: Nonbinary Logic Code
term status: stable
equivalent property: isFromConcentrate

Is Homogenised
type: ObjectProperty
type: Property
comment: A The indication whether or not the milk used was actively homogenised. The homogenisation of milk is a technical process in the dairy. The milk fat is milled to such an extent that further creaming is prevented.
domain: Milk Butter Cream Yogurt Cheese Eggs Substitutes
range: Nonbinary Logic Code
term status: stable
equivalent property: isHomogenised

Is Instant
type: ObjectProperty
type: Property
comment: Determines whether the product is instant.
domain: Food Beverage Tobacco Product
range: Nonbinary Logic Code
term status: stable
equivalent property: isInstant

Is Maternity
type: Property
type: ObjectProperty
comment: Indicates, with reference to the product branding, labelling or packaging, the descriptive term that is used by the product manufacturer to identify if the product is intended as maternity wear.
domain: Clothing
range: Nonbinary Logic Code
term status: stable
equivalent property: isMaternity

Only Available Through Retailer
type: Property
type: DatatypeProperty
comment: If specified and set to true, the discount is only available through the retailer making the offer.
domain: Discount
range: boolean
term status: stable
equivalent property: isOnlyAvailableThroughRetailer

Only For Retailer Mailing List Members
type: DatatypeProperty
type: Property
comment: If specified and set to true, the discount is only available for customers who have signed up to the retailer's mailing list.
domain: Discount
range: boolean
term status: stable
equivalent property: isOnlyWithMailingListSignup

Only With Payment Card
type: Property
type: DatatypeProperty
comment: If specified, the discount is only available when purchasing using one of the specified payment card types.
domain: Discount
range: Payment Method Code
term status: stable
equivalent property: isOnlyWithPaymentCard

Only For Retailer Loyalty Cardholders
type: Property
type: DatatypeProperty
comment: If specified and set to true, the discount is only available for holders of the retailer's own loyalty card.
domain: Discount
range: boolean
term status: stable
equivalent property: isOnlyWithRetailerLoyaltyCard

Only For Retailer Payment Cardholders
type: DatatypeProperty
type: Property
comment: If specified and set to true, the discount is only available for holders of the retailer's own store payment card.
domain: Discount
range: boolean
term status: stable
equivalent property: isOnlyWithRetailerPaymentCard

Is Patterned
type: ObjectProperty
type: Property
comment: The descriptive term that is used by the product manufacturer to identify whether or not the product has a patterned design.
domain: Wearable Product
range: Nonbinary Logic Code
term status: stable
equivalent property: isPatterned

Is Pitted Stoned
type: ObjectProperty
type: Property
comment: The descriptive term that is used by the product manufacturer to identify whether or not a fruit or vegetable product has been de-stoned or pitted prior to being offered for sale.
domain: Fruits and Vegetables
range: Nonbinary Logic Code
term status: stable
equivalent property: isPittedStoned

Is Product Recalled
type: FunctionalProperty
type: Property
type: DatatypeProperty
comment: An indicator for the product to determine if the Manufacturer or Supplier has recalled the product.
domain: Product
range: boolean
term status: stable
equivalent property: isProductRecalled

Is Promoter Exclusive Offer
type: DatatypeProperty
type: Property
comment: Determines whether the offer is only provided by the promoter
domain: Discount
range: boolean
term status: stable
equivalent property: isPromoterExclusiveOffer

Is Rind Edible
type: Property
type: ObjectProperty
comment: An indicator whether or not the cheese rind is edible. Some cheeses are coated in plastic or their surface is treated with other traditional substances to increase their shelf life. This can result in the rind no longer being edible.
domain: Milk Butter Cream Yogurt Cheese Eggs Substitutes
range: Nonbinary Logic Code
term status: stable
equivalent property: isRindEdible

Is Seedless
type: ObjectProperty
type: Property
comment: Determines whether the product is seedless as grown.
domain: Fruits and Vegetables
range: Nonbinary Logic Code
term status: stable
equivalent property: isSeedless

Is Shelled or Peeled
type: Property
type: ObjectProperty
comment: The descriptive term that is used by the product manufacturer to identify whether or not the product or its contents have been shelled/peeled prior to being offered for sale.
domain: Fruits and Vegetables
range: Nonbinary Logic Code
term status: stable
equivalent property: isShelledPeeled

Is Sliced
type: ObjectProperty
type: Property
comment: Determines whether the product comes pre-sliced.
domain: Food Beverage Tobacco Product
range: Nonbinary Logic Code
term status: stable
equivalent property: isSliced

Is Thermal
type: Property
type: ObjectProperty
comment: The descriptive term that is used to identify whether the product is thermal.
domain: Wearable Product
range: Nonbinary Logic Code
term status: stable
equivalent property: isThermal

Is Vintage
type: ObjectProperty
type: Property
comment: Identifies whether the product makes claim to being vintage.
domain: Beverage
range: Nonbinary Logic Code
term status: stable
equivalent property: isVintage

Is Washed Ready To Eat
type: Property
type: ObjectProperty
comment: Determines whether product has been prewashed and is ready to eat.
domain: Fruits and Vegetables
range: Nonbinary Logic Code
term status: stable
equivalent property: isWashedReadyToEat

Is Waterproof
type: ObjectProperty
type: Property
comment: The descriptive term that is used to identify whether or not the product claims to provide waterproofing to the applied surface.
domain: Wearable Product
range: Nonbinary Logic Code
term status: stable
equivalent property: isWaterproof

Is Wearable Item Disposable
type: Property
type: ObjectProperty
comment: Identifies whether or not the product is intended to be disposed of after single use or a limited period of use.
domain: Wearable Product
range: Nonbinary Logic Code
term status: stable
equivalent property: isWearableItemDisposable

Item Offered
type: ObjectProperty
type: Property
comment: The product included in the offer.
domain: Offer
range: Product
term status: stable
equivalent property: itemOffered

Juice Content Percent
type: Property
type: DatatypeProperty
comment: The fruit juice content of the product expressed as a percentage.
domain: Food Beverage Tobacco Product
range: float
term status: stable
equivalent property: juiceContentPercent

JSON Web Signature
type: Property
type: ObjectProperty
comment: A link to a JSON Web Signature
domain: Product
range: anyURI
sub property of: Link Type
term status: stable
equivalent property: jws

Latitude
type: DatatypeProperty
type: Property
comment: Angular distance North or South from the earth's equator measured through 90 degrees.
domain: GeoCoordinates
range: string
related match: lat
term status: stable
equivalent property: latitude

Leased from
type: ObjectProperty
type: Property
comment: Links to the organisation (lessor) from which this place is leased.
domain: Place
range: Organization
term status: stable
equivalent property: leasedFrom

Leased to
type: ObjectProperty
type: Property
comment: Links to the organisation(s) (lessee(s)) to which this place is leased. Property SHOULD be applied to a specific sub-location, rather than a main location, wherever possible.
domain: Place
range: Organization
term status: stable
equivalent property: leasedTo

Leave a review
type: Property
type: ObjectProperty
comment: A link through which a review can be added.
domain: Thing
range: anyURI
sub property of: Link Type
term status: stable
equivalent property: leaveReview

Lessee of location
type: ObjectProperty
type: Property
comment: Links to the place(s) for which this organisation is the lessee (i.e., this organisation leases those places from another organisation, the lessor).
domain: Organization
range: Place
term status: stable
equivalent property: lesseeOf

Lessor for
type: ObjectProperty
type: Property
comment: Links to the place(s) for which this organisation is the lessor (i.e., this organisation leases those places to others).
domain: Organization
range: Place
term status: stable
equivalent property: lessorFor

Line
type: DatatypeProperty
type: Property
comment: A line is a point-to-point path consisting of two or more point objects separated by a space. A single line segment (i.e., straight line) is expressed as two points. A multi-line path (i.e., open polygon) is expressed as a series of three or more points. For a closed shape, gs1:polygon SHALL be used.
domain: GeoShape
range: string
term status: stable
equivalent property: line

Link Type
type: Property
type: ObjectProperty
comment: Provides a URL for related information or services. This is not expected to be used directly but provides a super property for all other link types in the GS1 ecosystem.
domain: Thing
range: anyURI
broader: url
related match: mainEntityOfPage
related match: sameAs
term status: stable
equivalent property: linkType

Has Location
type: ObjectProperty
type: Property
comment: The place(s) associated with an organization.
domain: Organization
range: Place
term status: stable
equivalent property: location

Location Description
type: Property
type: DatatypeProperty
comment: The description of a place.
domain: Place
range: langString
term status: stable

Location Final Closure Date
type: Property
type: DatatypeProperty
comment: Date in which a location was finally closed. Note that this is NOT the date when a GLN was deactivated. To designate when location opened, see gs1:locationOpeningDate.
domain: Place
range: date
term status: stable

Location GLN
type: Property
type: DatatypeProperty
comment: 13-digit GLN that is being used to identify a physical or digital location. If gs1:glnType is present, gs1:locationGLN SHALL only be used when gs1:GLN_TypeCode includes FIXED_PHYSICAL_LOCATION, MOBILE_PHYSICAL_LOCATION, or DIGITAL_LOCATION
domain: Place
range: string
term status: stable
equivalent property: locationGLN

Has Location History
type: Property
type: ObjectProperty
comment: Provides details on if and when a location is active or inactive.
domain: Place
range: Location Status History
term status: stable
equivalent property: locationHistory

Location ID
type: Property
type: DatatypeProperty
comment: Identifier value associated to a location. This value SHALL follow rules set forth by the administrating organisation designated in gs1:LocationID_Type.
domain: Location ID Details
range: string
term status: stable
equivalent property: locationID

Location ID Qualifier
type: Property
type: DatatypeProperty
comment: Secondary qualifier to supplement gs1:LocationID_Type meaning. May be used with proprietary ID code values to define identifier administrator.
domain: Location ID Details
range: string
term status: stable
equivalent property: locationID Qualifier

Location ID
type: Property
type: ObjectProperty
comment: Organisation that administers the gs1:locationID or the name of the ID itself. Value from gs1:LocationID_Type code list.
domain: Location ID Details
range: Location ID Type
term status: stable
equivalent property: locationID Type

Location ID URI
type: Property
type: ObjectProperty
comment: A URI that links to information about the gs1:locationID.
domain: Location ID Details
range: anyURI
term status: stable
equivalent property: locationID URI

Location information
type: Property
type: ObjectProperty
comment: A link to a map, directions, or other location-related information. For B2B location information, see gs1:logisticsInfo. For details specific to hours of operation, see gs1:openingHoursInfo
domain: Thing
range: anyURI
sub property of: Link Type
term status: stable
equivalent property: locationInfo

Location Opening Date
type: Property
type: DatatypeProperty
comment: Date in which a location was opened or otherwise established. Note that this is NOT the date when a GLN was allocated to identify the location. To designate when location was finally closed, see gs1: gs1:locationFinalClosureDate
domain: Place
range: date
term status: stable

Location Role
type: ObjectProperty
type: Property
comment: A location classification based on the purpose, type of site and/or what occurs there. Repeatable value from gs1:LocationRoleType code list.
domain: Place
range: Location Role Code
term status: stable
equivalent property: locationRole

Location Status
type: Property
type: ObjectProperty
comment: Designation of active/inactive status of a location.
domain: Location Status History
range: Status Type
term status: stable
equivalent property: locationStatus

Logistics information
type: Property
type: ObjectProperty
comment: A link to B2B logistics information related to a physical location.
domain: Thing
range: anyURI
sub property of: Link Type
term status: stable
equivalent property: logisticsInfo

Longitude
type: DatatypeProperty
type: Property
comment: The arc or portion of the earth's equator intersected between the meridian of a given place and the prime meridian and expressed in degrees
domain: GeoCoordinates
range: string
related match: long
term status: stable
equivalent property: longitude

Loyalty program
type: Property
type: ObjectProperty
comment: A link to information about a loyalty program, including a member's current status and/or a registration option for new members
domain: Thing
range: anyURI
sub property of: Link Type
term status: stable
equivalent property: loyaltyProgram

Magnesium Per Nutrient Basis Quantity
type: Property
type: ObjectProperty
comment: Magnesium per specified nutrient basis quantity.
domain: Food Beverage Tobacco Product
range: Nutrition Measurement Type
term status: stable
equivalent property: magnesiumPerNutrientBasis

Makes Offer
type: ObjectProperty
type: Property
comment: An offer made by an organization.
domain: Organization
range: Offer
term status: stable
equivalent property: makesOffer

Managed by
type: ObjectProperty
type: Property
comment: Links to the organisation that manages this place or organisation, as designated by the owner or another organisation.
domain: Class
range: Organization
term status: stable
equivalent property: managedBy

Managed for
type: ObjectProperty
type: Property
comment: Links to the organisation(s) for whom this place is managed. Property SHOULD be applied to a specific sub-location, rather than a main location, wherever possible.
domain: Place
range: Organization
term status: stable
equivalent property: managedFor

Manages
type: ObjectProperty
type: Property
comment: Links to the place(s) or organisation(s) that this organisation manages, on behalf of the owner or another organisation.
domain: Organization
range: Class
term status: stable
equivalent property: manages

Manganese Per Nutrient Basis Quantity
type: Property
type: ObjectProperty
comment: Manganese per specified nutrient basis quantity.
domain: Food Beverage Tobacco Product
range: Nutrition Measurement Type
term status: stable
equivalent property: manganesePerNutrientBasis

Has Manufacturer
type: Property
type: ObjectProperty
comment: The organization that produces the item.
domain: Product
range: Organization
term status: stable
equivalent property: manufacturer

Manufacturer Preparation Code
type: ObjectProperty
type: Property
comment: Code indicating the preparation methods that a manufacturer has used in the manufacturing of a product for example DEEP_FRY.
domain: Food and Beverage Preparation Information
range: Preparation Type Code
term status: stable
equivalent property: manufacturerPreparationCode

Has Manufacturer's Warranty
type: Property
type: ObjectProperty
comment: The warranty associated with the product.
domain: Product
range: Warranty
broad match: warranty
term status: stable
equivalent property: manufacturersWarranty

Has Manufacturing Plant
type: Property
type: ObjectProperty
comment: A physical location consisting of one or more buildings with facilities for manufacturing.
domain: Product
range: Organization
term status: stable
equivalent property: manufacturingPlant

337n
type: FunctionalProperty
type: ObjectProperty
type: Property
comment: The mass per unit area of the item. This can be given using a number of different AI ranges that depend on the units in which the mass and area are measured.
domain: Product
label: Mass per unit area
range: Measurement Type
term status: stable
equivalent property: massPerUnitArea

Master data
type: Property
type: ObjectProperty
comment: A link to a source of structured master data for the entity. This is typically for B2B applications.
domain: Thing
range: anyURI
sub property of: Link Type
term status: stable
equivalent property: masterData

Master Data Available For
type: ObjectProperty
type: Property
comment: Links from a document, message or event to static data for specified identifiers.
domain: Thing
range: Thing
term status: stable
equivalent property: masterDataAvailableFor

Maturation Method Code
type: ObjectProperty
type: Property
comment: The method of maturity for the item for example tree ripened or jet fresh.
domain: Fruits and Vegetables
range: Maturation Method Code
term status: stable
equivalent property: maturationMethod

Maximum Price
type: DatatypeProperty
type: Property
comment: Provides a maximum price value as a floating-point numeric value that is qualified by the corresponding currency. See also gs1:priceCurrency
domain: Price Specification
range: float
term status: stable
equivalent property: maxPrice

Maximum Discount Amount
type: DatatypeProperty
type: Property
comment: Links to a gs1:PriceSpecification that indicates in terms of an amount and specified currency, the maximum discount on the sales price associated with a particular gs1:Discount. This property can be used to express 'up to $10 off'.
domain: Discount
range: Price Specification
term status: stable
equivalent property: maximumDiscountAmount

Maximum Discount Percentage
type: DatatypeProperty
type: Property
comment: A floating-point value indicating a maximum percentage discount on the sales price associated with a particular gs1:Discount. This property can be used to express 'up to 15% discount'.
domain: Discount
range: float
term status: stable
equivalent property: maximumDiscountPercentage

Maximum Optimum Consumption Temperature
type: ObjectProperty
type: Property
comment: The upper limit drinking temperature of the optimum range of the drinking temperature. The optimum range of the drinking temperature is a recommendation and is based on the experience of the individual producer. Allows for the representation of the same value in different units of measure but not multiple values.
domain: Food and Beverage Preparation Information
range: Measurement Type
term status: stable
equivalent property: maximumOptimumConsumptionTemperature

Maximum Qualifying Items
type: Property
type: DatatypeProperty
comment: Specifies the maximum number of items that qualify for a particular gs1:Discount. This property can be used to express 'maximum N items per customer'.
domain: Discount
range: integer
term status: stable
equivalent property: maximumQualifyingItems

Maximum Qualifying Spend
type: DatatypeProperty
type: Property
comment: Links to a gs1:PriceSpecification that indicates in terms of an amount and specified currency, the maximum spend that qualifies for a particular gs1:Discount. This property can be used to express 'for purchases of up to $100'.
domain: Discount
range: Price Specification
term status: stable
equivalent property: maximumQualifyingSpend

Meat Poultry Type Code
type: Property
type: DatatypeProperty
comment: The fish, meat, or poultry type for this food and beverage item.
domain: Meat Poultry
range: langString
term status: stable
equivalent property: meatPoultryType

Menu information
type: Property
type: ObjectProperty
comment: A link to menu details. This may include food menus, services, or other offerings provided by an organisation or at a location. For details specific to allergens only, see gs1:allergenInfo . For details specific to nutrition information only, see gs1:nutritionalInfo . For details specific to ingredients only, see gs1:ingredientsInfo .
domain: Thing
range: anyURI
sub property of: Link Type
term status: stable
equivalent property: menuInfo

Message Sender
type: Property
type: ObjectProperty
comment: Identifies the party receiving an electronic message
domain: Message
range: Organization
term status: provisional

Message Sender
type: Property
type: ObjectProperty
comment: Identifies the party sending an electronic message
domain: Message
range: Organization
term status: provisional

Minimum Price
type: DatatypeProperty
type: Property
comment: Provides a minimum price value as a floating-point numeric value that is qualified by the corresponding currency. See also gs1:priceCurrency
domain: Price Specification
range: float
term status: stable
equivalent property: minPrice

Minimum Discount Amount
type: DatatypeProperty
type: Property
comment: Links to a gs1:PriceSpecification that indicates in terms of an amount and specified currency, the minimum discount on the sales price associated with a particular gs1:Discount. This property can be used to express 'at least $10 off'.
domain: Discount
range: Price Specification
term status: stable
equivalent property: minimumDiscountAmount

Minimum Discount Percentage
type: Property
type: DatatypeProperty
comment: A floating-point value indicating a minimum percentage discount on the sales price associated with a particular gs1:Discount. This property can be used to express 'at least 15% discount'.
domain: Discount
range: float
term status: stable
equivalent property: minimumDiscountPercentage

Minimum Fish Content
type: Property
type: ObjectProperty
comment: The minimum amount of fish contained in a food and beverage product expressed as a measurement.
domain: Seafood
range: Measurement Type
term status: stable
equivalent property: minimumFishContent

Minimum Meat Poultry Content
type: Property
type: ObjectProperty
comment: The minimum amount of fish, meat or poultry contained in a food and beverage product expressed as a measurement.
domain: Meat Poultry
range: Measurement Type
term status: stable
equivalent property: minimumMeatPoultryContent

Minimum Optimum Consumption Temperature
type: Property
type: ObjectProperty
comment: The lower limit drinking temperature of the optimum range of the drinking temperature. The optimum range of the drinking temperature is a recommendation and is based on the experience of the individual producer. Allows for the representation of the same value in different units of measure but not multiple values.
domain: Food and Beverage Preparation Information
range: Measurement Type
term status: stable
equivalent property: minimumOptimumConsumptionTemperature

Minimum Qualifying Items
type: DatatypeProperty
type: Property
comment: Specifies the minimum number of items that must be purchased to qualify for a particular gs1:Discount. This property can be used to express 'if you buy at least N items'.
domain: Discount
range: integer
term status: stable
equivalent property: minimumQualifyingItems

Minimum Qualifying Spend
type: DatatypeProperty
type: Property
comment: Links to a gs1:PriceSpecification that indicates in terms of an amount and specified currency, the minimum spend required to qualify for a particular gs1:Discount. This property can be used to express 'if you spend at least $100'.
domain: Discount
range: Price Specification
term status: stable
equivalent property: minimumQualifyingSpend

Molybdenum Per Nutrient Basis Quantity
type: ObjectProperty
type: Property
comment: Molybdenum per specified nutrient basis quantity.
domain: Food Beverage Tobacco Product
range: Nutrition Measurement Type
term status: stable
equivalent property: molybdenumPerNutrientBasis

Monounsaturated Fat Per Nutrient Basis Quantity
type: ObjectProperty
type: Property
comment: Monounsaturated fat per specified nutrient basis quantity.
domain: Food Beverage Tobacco Product
range: Nutrition Measurement Type
term status: stable
equivalent property: monounsaturatedFatPerNutrientBasis

314n, 350n, 351n
type: Property
type: FunctionalProperty
type: ObjectProperty
comment: The net area of the item. This can be given using a number of different AI ranges that depend on the units in which the area is measured.
domain: Product
label: Net area
range: Measurement Type
term status: stable
equivalent property: netArea

360n, 361n, 364n, 365n, 366n
type: Property
type: ObjectProperty
type: FunctionalProperty
comment: The quantity of the product contained by a package, usually as claimed on the label. Indicates the net content of the total product. For fixed value products use the value claimed on the package, to avoid variable fill rate issue that arises with some product which are sold by volume or weight, and whose actual content may vary slightly from batch to batch.
domain: Product
label: Net content
range: Measurement Type
term status: stable
equivalent property: netContent

310n, 320n, 356n, 357n
type: FunctionalProperty
type: Property
type: ObjectProperty
comment: Used to identify the net weight of the product. Net Weight excludes all packaging material, including the packaging material of all lower-level GTINs. Example:11.5 kgm.
domain: Product
label: Net weight
range: Measurement Type
sub property of: weight
term status: stable
equivalent property: netWeight

Niacin Per Nutrient Basis Quantity
type: Property
type: ObjectProperty
comment: Niacin per specified nutrient basis quantity.
domain: Food Beverage Tobacco Product
range: Nutrition Measurement Type
term status: stable
equivalent property: niacinPerNutrientBasis

Number of Servings Per Package
type: DatatypeProperty
type: Property
comment: The total number of servings contained in the package.
domain: Food Beverage Tobacco Product
range: float
term status: stable
equivalent property: numberOfServingsPerPackage

Number of Servings Per Package Measurement Precision
type: ObjectProperty
type: Property
comment: Code indicating whether the number of servings per package is exact or approximate.
domain: Food Beverage Tobacco Product
range: Measurement Precision Code
term status: stable
equivalent property: numberOfServingsPerPackageMeasurementPrecision

Number of Servings Range Description
type: DatatypeProperty
type: Property
comment: A free text field specifying a range for the number of servings contained in the package.
domain: Food Beverage Tobacco Product
range: langString
term status: stable
equivalent property: numberOfServingsRangeDescription

Nutrient Basis Quantity
type: Property
type: ObjectProperty
comment: Quantity on which the nutrient information has been based; for example, per 100 grams. When specified, nutrientBasisQuantity establishes the basis for all contained nutrient records.
domain: Food Beverage Tobacco Product
range: Measurement Type
term status: stable
equivalent property: nutrientBasisQuantity

Nutrient Basis Quantity Type Code
type: ObjectProperty
type: Property
comment: The type of quantity specified in the nutrientBasisQuantity for example measurement, serving size, or container. This is used in conjunction with the nutrientBasisQuantity.
domain: Food Beverage Tobacco Product
range: Nutrient Basis Quantity Code
term status: stable
equivalent property: nutrientBasisQuantityType

Nutrient Measurement Precision
type: Property
type: ObjectProperty
comment: The Code indicating whether the specified nutrient content is exact or approximate.
domain: Food Beverage Tobacco Product
range: Measurement Precision Code
term status: stable
equivalent property: nutrientMeasurementPrecision

Nutritional Claim Code
type: ObjectProperty
type: Property
comment: Code indicating a nutritional claim applicable to the product, for example FAT_FREE.
domain: Food Beverage Tobacco Product
range: Nutritional Claim Type Code
term status: stable
equivalent property: nutritionalClaim

Nutritional Claim Statement
type: DatatypeProperty
type: Property
comment: Free text field for any additional nutritional claims.
domain: Food Beverage Tobacco Product
range: langString
term status: stable
equivalent property: nutritionalClaimStatement

Nutritional Information
type: Property
type: ObjectProperty
comment: A link to nutritional facts.
domain: Thing
range: anyURI
sub property of: Link Type
term status: stable
equivalent property: nutritionalInfo

Occupied by
type: ObjectProperty
type: Property
comment: Links to the organisation(s) that occupy this place. Property SHOULD be applied to a specific sub-location, rather than a main location, wherever possible.
domain: Place
range: Organization
term status: stable
equivalent property: occupiedBy

Occupies location
type: ObjectProperty
type: Property
comment: Links to the place(s) that this organisation occupies.
domain: Organization
range: Place
term status: stable
equivalent property: occupies

Offer Description
type: Property
type: DatatypeProperty
comment: A description of the offer including goods or services offered for sale or use.
domain: Offer
range: langString
sub property of: description
related: Offer
term status: stable
equivalent property: offerDescription

Offer Discount
type: Property
type: ObjectProperty
comment: A discount associated with an offer.
domain: Offer
range: Discount
term status: stable
equivalent property: offerDiscount

Offer Redemption Type
type: Property
type: DatatypeProperty
comment: A code indicating the type of redemptions that apply to the offer, for example single use.
domain: Discount
range: Offer Redemption Type Code
term status: stable
equivalent property: offerRedemptionType

Offer Redemption URL
type: ObjectProperty
type: Property
comment: The URL where the offer seeker will need to go in order to redeem the offer for an online redemption.
domain: Offer
range: Referenced File
term status: stable
equivalent property: offerRedemptionURL

Offer Restriction Description
type: DatatypeProperty
type: Property
comment: A description of what the offer is restricted to, relative to all other offerings by the issuer, for example payment restrictions, subscription required, new customers only.
domain: Discount
range: langString
sub property of: name
related: Offer
term status: stable
equivalent property: offerRestrictionDescription

Opening hours information
type: Property
type: ObjectProperty
comment: A link to details on hours of operation.
domain: Thing
range: anyURI
sub property of: Link Type
term status: stable
equivalent property: openingHoursInfo

Has Organic Claim
type: Property
type: ObjectProperty
comment: Relates to an organic claim about the product
domain: Product
range: Organic Claim Details
term status: stable
equivalent property: organicClaim

Organic Claim Agency Code
type: Property
type: ObjectProperty
type: FunctionalProperty
comment: A governing body that creates and maintains standards related to organic products.
domain: Organic Claim Details
range: Organic Claim Agency Code
term status: stable
equivalent property: organicClaimAgency

Organic Percent Claim
type: DatatypeProperty
type: Property
comment: The percent of actual organic materials per weight of the product. This is usually claimed on the product.
domain: Organic Claim Details
range: float
term status: stable
equivalent property: organicPercentClaim

Organisation Formation Date
type: Property
type: DatatypeProperty
comment: Date in which an organisation was formed or otherwise established. Note that this is NOT the date when a GLN was allocated to identify the organisation. To designate when organisation was terminated, see gs1:organizationTerminationDate
domain: Organization
range: date
term status: stable

Has Organization History
type: Property
type: ObjectProperty
comment: Provides details on if and when an organisation/party is active or inactive.
domain: Organization
range: Organisation Status History
term status: stable
equivalent property: organizationHistory

Organisation ID
type: Property
type: DatatypeProperty
comment: Identifier value associated to an organisation/party. This value SHALL follow rules set forth by the administrating organisation designated in gs1:OrganizationID_Type.
domain: Organisation ID Details
range: string
term status: stable
equivalent property: organizationID

Organisation ID Qualifier
type: Property
type: DatatypeProperty
comment: Secondary qualifier to supplement gs1:organizationID_Type meaning. May be used with proprietary ID code values to define identifier administrator.
domain: Organisation ID Details
range: string
term status: stable
equivalent property: organizationID Qualifier

Organisation ID
type: Property
type: ObjectProperty
comment: Organisation that administers the gs1:organizationID or the name of the ID itself. Value from gs1:OrganizationID_Type code list.
domain: Organisation ID Details
range: Organization ID Type
term status: stable
equivalent property: organizationID Type

Organisation ID URI
type: Property
type: ObjectProperty
comment: A URI that links to information about the gs1:organizationID.
domain: Organisation ID Details
range: anyURI
term status: stable
equivalent property: organizationID URI

Organization Legal Name
type: Property
type: DatatypeProperty
comment: The legal name used by an organisation for official purposes. There may be more than one legal name, particularly in countries with more than one official language. In such cases the language of the string should be identified. To specify a general name, see gs1:organizationName. For trade name, see gs1:organizationTradingName. To specify the name of a function, see gs1:department.
domain: Organization
range: langString
term status: stable

Organization Name
type: DatatypeProperty
type: Property
comment: The name of the organization expressed in text.
domain: Class
  union of: Address
  union of: Organization
range: langString
sub property of: name
related: Organization
related: PostalAddress
term status: stable
equivalent property: organizationName

Has Organization Role
type: Property
type: ObjectProperty
comment: The role and/or purpose of a party (i.e. legal entity or function). Multiple values from gs1:OrganizationRoleType code list may be associated to a single organisation/party.
domain: Organization
range: Organization Role Code
term status: stable
equivalent property: organizationRole

Organisation Status
type: Property
type: ObjectProperty
comment: Designation of active/inactive status of an organisation/party.
domain: Organisation Status History
range: Status Type
term status: stable
equivalent property: organizationStatus

Organisation Termination Date
type: Property
type: DatatypeProperty
comment: Date in which an organisation was disbanded or otherwise ended. Note that this is NOT the date when a GLN was deactivated. To designate when organisation formed, see gs1:organizationFormationDate.
domain: Organization
range: date
term status: stable

Organization Trading Name
type: Property
type: DatatypeProperty
comment: A trading name or alternative forms of a legal entity's name as recognised by some jurisdictions. To specify a general name, see gs1:organizationName. For legal name, see gs1:organizationLegalName. To specify the name of a function, see gs1:department.
domain: Organization
range: langString
term status: stable

Original Code Value
type: Property
type: DatatypeProperty
comment: Links to the alphanumeric code value defined elsewhere in GS1 or the GS1 Global Data Dictionary
domain: Type Code
range: string
term status: stable
equivalent property: originalCodeValue

Out of Package Depth
type: ObjectProperty
type: Property
comment: The depth of the product out of its packaging, as measured according to the GS1 Package Measurement Rules. See https://www.gs1.org/package-measurement-rules-implementation-guide for more details.
domain: Product
range: Measurement Type
broad match: depth
term status: stable
equivalent property: outOfPackageDepth

Out of Package Diameter
type: Property
type: ObjectProperty
comment: The measurement of the diameter of the product out of its package at its largest point. For example, 165 MMT.
domain: Product
range: Measurement Type
term status: stable
equivalent property: outOfPackageDiameter

Out of Package Height
type: Property
type: ObjectProperty
comment: The height of the product out of the package, as measured according to the GS1 Package Measurement Rules. See https://www.gs1.org/package-measurement-rules-implementation-guide for more details.
domain: Product
range: Measurement Type
broad match: height
term status: stable
equivalent property: outOfPackageHeight

Out of Package Width
type: Property
type: ObjectProperty
comment: The width of the product out of the package, as measured according to the GS1 Package Measurement Rules. See https://www.gs1.org/package-measurement-rules-implementation-guide for more details.
domain: Product
range: Measurement Type
broad match: width
term status: stable
equivalent property: outOfPackageWidth

Owned by
type: ObjectProperty
type: Property
comment: Links to the organisation(s) that own this place, in full or in part. This includes joint ventures. For leased locations, see gs1:lessorFor and gs1:isLeasedFrom.
domain: Class
range: Organization
term status: stable
equivalent property: ownedBy

Owns
type: ObjectProperty
type: Property
comment: Links to the place(s) or organisation(s) that this organisation owns.
domain: Organization
range: Class
term status: stable
equivalent property: owns

Has Packaging
type: ObjectProperty
type: Property
comment: Details on the packaging for a product including type, weight and materials.
domain: Product
range: Packaging
term status: stable
equivalent property: packaging

13
type: ObjectProperty
type: Property
comment: The packaging date is the date when the goods were packed as determined by the packager. The date may refer to the trade item itself or to items contained.
domain: Product
label: Packaging Date
range: date
notation: 13
term status: stable
equivalent property: packagingDate

Packaging Feature
type: ObjectProperty
type: Property
comment: Code indicating a feature that facilitates the usage of the product by the consumer, for example a handle. Packaging features do not affect the core composition of the packaging type nor modify its usage.
domain: Packaging
range: Packaging Feature Code
term status: stable
equivalent property: packagingFeature

Packaging Function
type: Property
type: ObjectProperty
comment: Code indicating specific functionality for packaging resulting from specific processes or features present in the packaging type,for example, ANTI_TAMPERING.
domain: Packaging
range: Packaging Function Code
term status: stable
equivalent property: packagingFunction

Packaging Marked Diet Allergen Type Code
type: ObjectProperty
type: Property
comment: Indication of which dietary or allergen marks are on the package.
domain: Food Beverage Tobacco Product
range: Packaging Marked Diet Allergen Code
term status: stable
equivalent property: packagingMarkedDietAllergenType

Packaging Marked Free From Code
type: Property
type: ObjectProperty
comment: Indication of the food ingredients that the package is marked free from.
domain: Food Beverage Tobacco Product
range: Packaging Marked Free From Code
term status: stable
equivalent property: packagingMarkedFreeFrom

Accreditation Code
type: Property
type: ObjectProperty
comment: A marking that the product received recognition, endorsement, certification by following guidelines by the label issuing agency. This does not represent claims for regulatory purposes on products such as free from markings.
domain: Product
range: Packaging Marked Label Accreditation Code
term status: stable
equivalent property: packagingMarkedLabelAccreditation

Has Packaging Material Details
type: ObjectProperty
type: Property
comment: links to details about packaging material type, quantity and thickness
domain: Packaging
range: Packaging Material Details
term status: stable
equivalent property: packagingMaterial

Packaging Material Composition Quantity
type: ObjectProperty
type: Property
comment: The quantity of the packaging material of the product. Can be weight, volume or surface, can vary by country.
domain: Packaging Material Details
range: Measurement Type
term status: stable
equivalent property: packagingMaterialCompositionQuantity

Packaging Material Thickness
type: Property
type: ObjectProperty
comment: The thickness of a packaging material.
domain: Packaging Material Details
range: Measurement Type
term status: stable
equivalent property: packagingMaterialThickness

Packaging Material Type
type: ObjectProperty
type: Property
comment: The materials used for the packaging of the product for example glass or plastic.
domain: Packaging Material Details
range: Packaging Material Type Code
term status: stable
equivalent property: packagingMaterialType

Packaging Recycling Process Type
type: Property
type: ObjectProperty
comment: The process the packaging could undertake for recyclable & sustainability programs. Examples COMPOSTABLE, ENERGY_RECOVERABLE, REUSABLE.
domain: Packaging
range: Packaging Recycling Process Type Code
term status: stable
equivalent property: packagingRecyclingProcessType

Packaging Recycling Scheme
type: ObjectProperty
type: Property
comment: A code indicating the recycling scheme the packaging of this product will fall within when recycled. Applies to recyclable packaging with or without deposit.
domain: Packaging
range: Packaging Recycling Scheme Code
term status: stable
equivalent property: packagingRecyclingScheme

Packaging Shape
type: Property
type: ObjectProperty
comment: A code depicting the shape of a package for example CONE.
domain: Packaging
range: Packaging Shape Code
term status: stable
equivalent property: packagingShape

Packaging Type
type: DatatypeProperty
type: Property
comment: The dominant means used to transport, store, handle or display the product as defined by the data source. This packaging is not used to describe any manufacturing process.Recommend to use UNECE Rec 21 codes.
domain: Packaging
range: string
term status: stable
equivalent property: packagingType

Pantothenic Acid Per Nutrient Basis Quantity
type: Property
type: ObjectProperty
comment: Pantothenic Acid per specified nutrient basis quantity.
domain: Food Beverage Tobacco Product
range: Nutrition Measurement Type
term status: stable
equivalent property: pantothenicAcidPerNutrientBasis

Parent Organization
type: Property
type: ObjectProperty
comment: Designates the legal entity or function directly above the organisation/party being identified in a hierarchy. This is not defaulted to the highest-level entity in the hierarchy. Only one parent organisation SHALL be associated to a single GLN. To specify other affiliated organisations, see gs1:affiliatedTo, gs1:managedBy, gs1:franchiseeOf, gs1:ownedBy. To specify an organisation/party lower in the hierarchy, see gs1:subOrganization.
domain: Organization
range: Organization
term status: stable
equivalent property: parentOrganization

Party GLN
type: Property
type: DatatypeProperty
comment: 13-digit GLN that is being used to identify a legal entity or function. If gs1:glnType is present, gs1:partyGLN SHALL only be used when gs1:GLN_TypeCode includes LEGAL_ENTITY and/or FUNCTION
domain: Organization
range: string
term status: stable
equivalent property: partyGLN

Make Payment
type: Property
type: ObjectProperty
comment: A link to a place where payments details are provided and/or payments can be made by the user.
domain: Thing
range: anyURI
sub property of: Link Type
term status: stable
equivalent property: paymentLink

Payment Terms
type: DatatypeProperty
type: Property
comment: The type of payment term expressed as a code, for example Discount.
domain: Offer
range: string
term status: stable
equivalent property: paymentTerms

Percentage of Alcohol Per Volume
type: DatatypeProperty
type: Property
comment: The percentage of alcohol contained in product.
domain: Beverage
range: float
term status: stable
equivalent property: percentageOfAlcoholByVolume

Phosphorus Per Nutrient Basis Quantity
type: Property
type: ObjectProperty
comment: Phosphorus per specified nutrient basis quantity.
domain: Food Beverage Tobacco Product
range: Nutrition Measurement Type
term status: stable
equivalent property: phosphorusPerNutrientBasis

Physical Location Name
type: Property
type: DatatypeProperty
comment: The name of a physical place. To specify the name of a digital location, see gs1:digitalLocationName.
domain: Place
range: langString
term status: stable
equivalent property: physicalLocationName

Product Information Page
type: Property
type: ObjectProperty
comment: A link to information specifically about the identified item, typically operated by the brand owner or a retailer of the product and aimed at consumers. It may include links to further information, product description, specifications etc.
domain: Thing
range: anyURI
sub property of: Link Type
term status: stable
equivalent property: pip

Polygon
type: DatatypeProperty
type: Property
comment: A polygon is the area enclosed by a point-to-point path for which the starting and ending points are the same. A polygon is expressed as a series of four or more space delimited points where the first and final points are identical.
domain: GeoShape
range: string
term status: stable
equivalent property: polygon

Polyols Per Nutrient Basis Quantity
type: Property
type: ObjectProperty
comment: Polyols per specified nutrient basis quantity.
domain: Food Beverage Tobacco Product
range: Nutrition Measurement Type
term status: stable
equivalent property: polyolsPerNutrientBasis

Polyunsaturated Fat Per Nutrient Basis Quantity
type: Property
type: ObjectProperty
comment: Polyunsaturated fat per specified nutrient basis quantity.
domain: Food Beverage Tobacco Product
range: Nutrition Measurement Type
term status: stable
equivalent property: polyunsaturatedFatPerNutrientBasis

PO Box Number
type: DatatypeProperty
type: Property
comment: The number that identifies a PO box. A PO box is a box in a post office or other postal service location assigned to an organization where postal items may be kept.
domain: Address
range: string
term status: stable
equivalent property: postOfficeBoxNumber

Postal Code
type: DatatypeProperty
type: Property
comment: Text specifying the postal code for an address.
domain: Address
range: string
term status: stable
equivalent property: postalCode

Postal Name
type: DatatypeProperty
type: Property
comment: The name of the recipient expressed in text. Note that this may be different than gs1:OrganizationName.
domain: Address
range: langString
term status: stable
equivalent property: postalName

Potassium Per Nutrient Basis Quantity
type: ObjectProperty
type: Property
comment: Potassium per specified nutrient basis quantity.
domain: Food Beverage Tobacco Product
range: Nutrition Measurement Type
term status: stable
equivalent property: potassiumPerNutrientBasis

Preparation Type Code
type: ObjectProperty
type: Property
comment: Code specifying the preparation state of the product for which the nutrient information is valid. PREPARED, UNPREPARED.
domain: Food and Beverage Preparation Information
range: Preparation Type Code
term status: stable
equivalent property: preparationCode

Preparation Consumption Precautions
type: Property
type: DatatypeProperty
comment: Specifies additional precautions to be taken before preparation or consumption of the product.
domain: Food and Beverage Preparation Information
range: langString
term status: stable
equivalent property: preparationConsumptionPrecautions

Has Food And Beverage Preparation Information
type: ObjectProperty
type: Property
comment: Links to information about how to prepare a specific Food/Beverage/Tobacco product.
domain: Food Beverage Tobacco Product
range: Food and Beverage Preparation Information
term status: stable
equivalent property: preparationInformation

Preparation Instructions
type: DatatypeProperty
type: Property
comment: Free text providing instructions on how to prepare the product before serving.
domain: Food and Beverage Preparation Information
range: langString
term status: stable
equivalent property: preparationInstructions

Preservation Technique
type: Property
type: ObjectProperty
comment: Code indicating the preservation technique used to preserve the product from deterioration, for example, BRINING.
domain: Food Beverage Tobacco Product
range: Preservation Technique Code
term status: stable
equivalent property: preservationTechnique

Price Value
type: DatatypeProperty
type: Property
comment: Provides a price value as a floating-point numeric value that is qualified by the corresponding currency. See also gs1:priceCurrency. The price value indicates the unit price unless the property gs1:eligibleQuantity is specified and indicates multiple units
domain: Price Specification
range: float
term status: stable
equivalent property: price

Price Currency
type: Property
type: DatatypeProperty
comment: A string value indicating a currency from ISO 4217 for example USD .
domain: Price Specification
range: string
term status: stable
equivalent property: priceCurrency

Price Specification
type: Property
type: ObjectProperty
comment: The price related to an offer. If the offer is a multi-buy offer for a quantity of product greater than one unit, this should be indicated using the property gs1:eligibleQuantity
domain: Offer
range: Price Specification
term status: stable
equivalent property: priceSpecification

Has Primary Alternate Product
type: ObjectProperty
type: Property
comment: A product that is similar to the current product but is not exact match. Same form fit function, e.g. same product different colour, different package size, better quality.
domain: Product
range: Product
sub property of: isSimilarTo
term status: stable
equivalent property: primaryAlternateProduct

Primary location of
type: ObjectProperty
type: Property
comment: Links to the organisation(s) that designate this place as its/their primary location. Property SHOULD be applied to a specific sub-location, rather than a main location, wherever possible.
domain: Place
range: Organization
term status: stable
equivalent property: primaryLocationOf

Product Description
type: Property
type: DatatypeProperty
comment: An understandable and useable description of a product using brand and other descriptors. This attribute is filled with as little abbreviation as possible, while keeping to a reasonable length. This should be a meaningful description of the product with full spelling to facilitate message processing. Retailers can use this description as the base to fully understand the brand, flavour, scent etc. of the specific product, in order to accurately create a product description as needed for their internal systems. Examples: XYZ Brand Base Invisible Solid Deodorant AP Stick Spring Breeze.
domain: Product
range: langString
sub property of: description
related: Product
term status: stable
equivalent property: productDescription

Product Feature Benefit
type: DatatypeProperty
type: Property
comment: Element for consumer facing marketing content to describe the key features or benefits of the style suitable for display purposes.
domain: Product
range: langString
term status: stable
equivalent property: productFeatureBenefit

Product Form Description
type: DatatypeProperty
type: Property
comment: The physical form or shape of the product. Used, for example, in pharmaceutical industry to indicate the formulation of the product. Defines the form the product takes and is distinct from the form of the packaging.
domain: Product
range: langString
term status: stable
equivalent property: productFormDescription

Product ID
type: DatatypeProperty
type: FunctionalProperty
type: Property
comment: Additional means to the Global Trade Item Number to identify a product.
domain: Product
range: string
term status: stable
equivalent property: productID

Product Marketing Message
type: Property
type: DatatypeProperty
comment: Marketing message associated with the product. Consumer-friendly marketing detailed description of the product.
domain: Product
range: langString
term status: stable
equivalent property: productMarketingMessage

Product Name
type: Property
type: DatatypeProperty
comment: Consumer friendly short description of the product suitable for compact presentation.
domain: Product
range: langString
sub property of: name
related: Product
term status: stable
equivalent property: productName

Product Range
type: Property
type: DatatypeProperty
comment: A name, used by a Brand Owner, that span multiple consumer categories or uses. E.g. (Waist Watchers).
domain: Product
range: langString
related: brand
term status: stable
equivalent property: productRange

Sustainability and recycling (deprecated)
type: Property
type: ObjectProperty
comment: This term has been deprecated. Please use gs1:sustainabilityInfo instead.
domain: Product
range: anyURI
sub property of: Link Type
term status: deprecated
equivalent property: productSustainabilityInfo

Product Yield
type: ObjectProperty
type: Property
comment: Product quantity after preparation. This can differ based on productYieldType
domain: Product Yield Details
range: Measurement Type
term status: stable
equivalent property: productYield

Product Yield Type Code
type: ObjectProperty
type: Property
comment: Code indicating the type of yield measurement specified in productYield. Examples: AFTER_DILUTION, DRAINED_WEIGHT.
domain: Product Yield Details
range: Product Yield Type Code
term status: stable
equivalent property: productYieldType

Product Yield Variation Percentage
type: DatatypeProperty
type: Property
comment: Indication of range in percent of the given cooking / roasting loss. Percentage that the actual weight of the product differs upward or downward from the average or estimated product yield.
domain: Product Yield Details
range: float
term status: stable
equivalent property: productYieldVariationPercentage

11
type: ObjectProperty
type: Property
comment: The production date is the production or assembly date determined by the manufacturer. The date may refer to the trade item itself or to items contained.
domain: Product
label: Production Date
range: date
notation: 11
term status: stable
equivalent property: productionDate

8008
type: ObjectProperty
type: Property
comment: The date and time of production (or assembly). The date and time of production is determined by the manufacturer. The date and time may refer to the trade item itself or to the items contained.
domain: Product
label: Production Date and Time
range: dateTime
notation: 8008
term status: stable
equivalent property: productionDateTime

Production Variant Description
type: DatatypeProperty
type: Property
comment: Free text assigned by the manufacturer to describe the production variant. Examples are: package series X, package series Y.
domain: Product
range: langString
term status: stable
equivalent property: productionVariantDescription

Production Variant Effective Date Time
type: Property
type: DatatypeProperty
comment: The start date of a production variant. The variant applies to products having a date mark (a best before date or expiration date) on the package that comes on or after the effective date.
domain: Product
range: dateTime
term status: stable
equivalent property: productionVariantEffectiveDateTime

Promotion
type: Property
type: ObjectProperty
comment: A link to a promotion.
domain: Thing
range: anyURI
sub property of: Link Type
term status: stable
equivalent property: promotion

Protein Per Nutrient Basis Quantity
type: ObjectProperty
type: Property
comment: Protein per specified nutrient basis quantity.
domain: Food Beverage Tobacco Product
range: Nutrition Measurement Type
term status: stable
equivalent property: proteinPerNutrientBasis

Provenance Statement
type: DatatypeProperty
type: Property
comment: Free text description of the region or place the product originates from. This is to be specifically used to specify areas such as cities, mountain ranges, regions. Examples: Made in the Thuringen Mountains, Made in Paris, From the Napa Valley.
domain: Product
range: langString
term status: stable
equivalent property: provenanceStatement

Purchase supplies or accessories
type: Property
type: ObjectProperty
comment: A link to information about where supplies or accessories for the item can be purchased or ordered.
domain: Thing
range: anyURI
sub property of: Link Type
term status: stable
equivalent property: purchaseSuppliesOrAccessories

Qualifying Brand Name
type: Property
type: DatatypeProperty
comment: If specified, the discount is only available when purchasing a product from one of the brand names specified via this property.
domain: Discount
range: langString
term status: stable
equivalent property: qualifyingBrandName

Qualifying Product GPC codes
type: DatatypeProperty
type: Property
comment: If specified, the discount is only available when purchasing a product whose Global Product Classification (GPC) brick value appears in the list specified via this property.
domain: Discount
range: string
term status: stable
equivalent property: qualifyingGPCs

Qualifying Product Category Description
type: DatatypeProperty
type: Property
comment: If specified, the discount is only available when purchasing a product from categories specified in this free-form text field.
domain: Discount
range: langString
term status: stable
equivalent property: qualifyingProductCategoryDescription

Qualifying Product Classification Code
type: FunctionalProperty
type: Property
type: DatatypeProperty
comment: If specified, the discount is only available when purchasing a product whose product classification (other than GPC) appears in the list specified via this property. This property specifies a product classification other than GPC.
domain: Discount
range: Additional Product Classification Details
term status: stable
equivalent property: qualifyingProductClassificationCode

Qualifying Product GTINs
type: Property
type: DatatypeProperty
comment: If specified, the discount is only available when purchasing a product whose GTIN appears in the list specified via this property.
domain: Discount
range: string
term status: stable
equivalent property: qualifyingProductGTINs

Qualifying Sub-brand Name
type: Property
type: DatatypeProperty
comment: If specified, the discount is only available when purchasing a product from one of the sub-brand names (specified product ranges for a given brand) specified via this property.
domain: Discount
range: langString
term status: stable
equivalent property: qualifyingSubBrandName

Quick start guide
type: Property
type: ObjectProperty
comment: A link to a description of the key features needed to be understood to begin using the item or interacting with something new.
domain: Thing
range: anyURI
sub property of: Link Type
term status: stable
equivalent property: quickStartGuide

Recall status
type: Property
type: ObjectProperty
comment: A link to information about whether the product has been recalled or not, typically an API.
domain: Thing
range: anyURI
sub property of: Link Type
term status: stable
equivalent property: recallStatus

Recipe website
type: Property
type: ObjectProperty
comment: A link to a recipe website.
domain: Thing
range: anyURI
sub property of: Link Type
term status: stable
equivalent property: recipeInfo

Has Referenced File
type: Property
type: ObjectProperty
comment: Link to a file or website containing additional information on product.
domain: Product
range: Referenced File
term status: stable
equivalent property: referencedFile

Referenced File Effective End Date
type: Property
type: DatatypeProperty
comment: The date upon which the target of this external link ceases to be effective for use.
domain: Referenced File
range: dateTime
sub property of: expires
term status: stable
equivalent property: referencedFileEffectiveEndDateTime

Referenced File Effective Start Date
type: Property
type: DatatypeProperty
comment: The date upon which the target of this external link begins to be effective for use.
domain: Referenced File
range: dateTime
term status: stable
equivalent property: referencedFileEffectiveStartDateTime

Referenced File Size
type: Property
type: ObjectProperty
comment: The size of the file as it is stored in an uncompressed format.
domain: Referenced File
range: Measurement Type
sub property of: contentSize
term status: stable
equivalent property: referencedFileSize

Referenced File Type
type: Property
type: ObjectProperty
comment: A code indicating the purpose or role of file (not a MIME type) that is being referenced, for example PRODUCT_LABEL_IMAGE. This code is used when the purpose of a file is not specified in the property.
domain: Referenced File
range: Referenced File Type Code
term status: stable
equivalent property: referencedFileType

Website
type: DatatypeProperty
type: Property
comment: Simple text string that refers to a resource on the internet, URLs may refer to documents, resources, people, etc.
domain: Referenced File
range: anyURI
sub property of: url
term status: stable
equivalent property: referencedFileURL

Register purchase
type: Property
type: ObjectProperty
comment: A link to an entry point for registering ownership of a product including for warranty purposes.
domain: Thing
range: anyURI
sub property of: Link Type
term status: stable
equivalent property: registerProduct

Entry in a register
type: Property
type: ObjectProperty
comment: A link to an entry in a register, such as a business register or register of locations. Such registers may act as alternative identifiers, such as official company numbers, LEIs, other location identifiers etc.
domain: Thing
range: anyURI
sub property of: Link Type
term status: stable
equivalent property: registryEntry

Regulated Product Name
type: Property
type: DatatypeProperty
comment: The prescribed, regulated or generic product name or denomination that describes the true nature of the product. For example for a food product in order to distinguish it from other foods according to country specific regulations.
domain: Product
range: langString
broad match: name
related: Product
term status: stable
equivalent property: regulatedProductName

Regulation Type
type: Property
type: ObjectProperty
comment: Links to a code indicating the type of government regulation.
domain: Regulatory Information
range: Regulation Type Code
term status: provisional

Regulatory Act
type: Property
type: DatatypeProperty
comment: The name given to the requirement assigned by the regulatory agency.
domain: Regulatory Information
range: string
term status: provisional

Regulatory Identifier
type: Property
type: ObjectProperty
comment: Links to one or more groupings of identifiers that reference documents or datasets within a regulatory information system, repository or registry.
domain: Regulatory Information
range: Regulatory Identifier
term status: provisional

Regulatory Identifier Type
type: Property
type: ObjectProperty
comment: The code indicating the type of regulatory information that is referenced.
domain: Regulatory Identifier
range: Regulatory Identifier Type
term status: provisional

Regulatory Information
type: Property
type: ObjectProperty
comment: Links to one or more groupings of information on applicable government regulations applicable to a trade item.
domain: Class
  union of: Product
  union of: Regulatory Notification
range: Regulatory Information
term status: provisional

Regulatory Information Provider
type: Property
type: ObjectProperty
comment: The organisation that provided a document or dataset to a regulatory information system, repository or registry.
domain: Regulatory Identifier
range: Organization
term status: provisional

Regulatory Reference Applicability End Date
type: Property
type: DatatypeProperty
comment: The final date for which the referenced information remains applicable.
domain: Regulatory Identifier
range: date
term status: provisional

Regulatory Reference Applicability Start Date
type: Property
type: DatatypeProperty
comment: The earliest date from which the referenced information becomes applicable.
domain: Regulatory Identifier
range: date
term status: provisional

Regulatory Reference Number
type: Property
type: DatatypeProperty
comment: A reference number for a record, document or dataset stored within a regulatory information system, repository or registry.
domain: Regulatory Identifier
range: string
term status: provisional

Regulatory Verification Number
type: Property
type: DatatypeProperty
comment: A verification number for a record, document or dataset stored within a regulatory information system, repository or registry, typically used in combination with the reference number when requesting access to the refrenced document or dataset.
domain: Regulatory Identifier
range: string
term status: provisional

Reheating Claim
type: ObjectProperty
type: Property
comment: Indicates, with reference to the product branding, labelling or packaging whether a food product which is ready to eat can be reheated if required prior to consumption.
domain: Food Beverage Tobacco Product
range: Nonbinary Logic Code
term status: stable
equivalent property: reheatingClaim

Related image
type: Property
type: ObjectProperty
comment: A link to any image that depicts or relates to the identified entity (e.g., trade item, assets, business process, patient record, location, organisation, etc.)
domain: Thing
range: anyURI
sub property of: Link Type
term status: stable
equivalent property: relatedImage

Has Organisation
type: ObjectProperty
type: Property
comment: The organisation(s) associated with a place.
domain: Place
range: Organization
term status: stable
equivalent property: relatedOrganization

Related video
type: Property
type: ObjectProperty
comment: A link to any video, or document that has an embedded video, that describes or relates to the identified item, organisation, or location in some way.
domain: Thing
range: anyURI
sub property of: Link Type
term status: stable
equivalent property: relatedVideo

Replaced by organization
type: Property
type: ObjectProperty
comment: Links to the successor organisation that is used in place of a previous organisation
domain: Organization
range: Organization
term status: stable
equivalent property: replacedByOrganization

Replaced by Place
type: Property
type: ObjectProperty
comment: Links to the successor location that is used in place of a previous location
domain: Place
range: Place
term status: stable
equivalent property: replacedByPlace

Has Replaced By Product
type: Property
type: ObjectProperty
comment: The product which permanently replaces the current product. This product is sent in the record for the original item that is being replaced.
domain: Product
range: Product
sub property of: isSimilarTo
term status: stable
equivalent property: replacedByProduct

Replaced organization
type: Property
type: ObjectProperty
comment: Links to the previous organisation that this organisation replaces
domain: Organization
range: Organization
term status: stable
equivalent property: replacedOrganization

Replaced Place
type: Property
type: ObjectProperty
comment: Links to the previous location that this location replaces
domain: Place
range: Place
term status: stable
equivalent property: replacedPlace

Has Replaced Product
type: Property
type: ObjectProperty
comment: Indicates the product identification of an item that is being permanently replaced by this product.
domain: Product
range: Product
sub property of: isSimilarTo
term status: stable
equivalent property: replacedProduct

Report found
type: Property
type: ObjectProperty
comment: A link to a platform or service where users (company or a person) can report a found item associated with the identified entity (instance of an item). This link type is designed to assist in connecting the found item with its rightful owner or relevant authorities.
domain: Thing
range: anyURI
sub property of: Link Type
term status: stable
equivalent property: reportFound

Responsibility
type: DatatypeProperty
type: Property
comment: Text further specifying the area of responsibility of the trade contact.
domain: Contact
range: langString
term status: stable
equivalent property: responsibility

Responsible for location
type: ObjectProperty
type: Property
comment: Links to the place(s) for which this organisation is responsible.
domain: Organization
range: Place
term status: stable
equivalent property: responsibleForLocation

Organisation responsible for the location
type: ObjectProperty
type: Property
comment: Links to the organisation that is directly responsible for this place.
domain: Place
range: Organization
term status: stable
equivalent property: responsibleOrganization

Returnable Package Deposit Amount
type: Property
type: ObjectProperty
comment: The monetary amount for the individual returnable package.
domain: Returnable Package Deposit Details
range: Price Specification
term status: stable
equivalent property: returnablePackageDepositAmount

Returnable Package Deposit Region
type: ObjectProperty
type: Property
comment: The geographic region associated with the returnable package deposit amount.
domain: Returnable Package Deposit Details
range: Country
term status: stable
equivalent property: returnablePackageDepositRegion

Reviews
type: Property
type: ObjectProperty
comment: A link to reviews.
domain: Thing
range: anyURI
sub property of: Link Type
term status: stable
equivalent property: review

Riboflavin Per Nutrient Basis Quantity
type: ObjectProperty
type: Property
comment: Riboflavin per specified nutrient basis quantity.
domain: Food Beverage Tobacco Product
range: Nutrition Measurement Type
term status: stable
equivalent property: riboflavinPerNutrientBasis

Safety information
type: Property
type: ObjectProperty
comment: A link to safety information.
domain: Thing
range: anyURI
sub property of: Link Type
term status: stable
equivalent property: safetyInfo

Salt Per Nutrient Basis Quantity
type: ObjectProperty
type: Property
comment: Salt per specified nutrient basis quantity.
domain: Food Beverage Tobacco Product
range: Nutrition Measurement Type
term status: stable
equivalent property: saltPerNutrientBasis

Saturated Fat Per Nutrient Basis Quantity
type: Property
type: ObjectProperty
comment: Saturated fat per specified nutrient basis quantity.
domain: Food Beverage Tobacco Product
range: Nutrition Measurement Type
term status: stable
equivalent property: saturatedFatPerNutrientBasis

Scheduling/Reservation
type: Property
type: ObjectProperty
comment: A link to a site that offers information on scheduling, appointments, or reservations. This may or may not allow the user to book the reservation.
domain: Thing
range: anyURI
sub property of: Link Type
term status: stable
equivalent property: scheduleTime

Season Calendar Year
type: Property
type: DatatypeProperty
comment: The calendar year in which the product is seasonally available.
domain: Wearable Product
range: gYear
term status: stable
equivalent property: seasonCalendarYear

Season Name
type: Property
type: DatatypeProperty
comment: Element defines the season applicable to the item for example Winter.
domain: Wearable Product
range: langString
term status: stable
equivalent property: seasonName

Season Parameter
type: ObjectProperty
type: Property
comment: Code indicating the season in which the product is available, e.g. SPRING, WINTER
domain: Wearable Product
range: Season Parameter Code
term status: stable
equivalent property: seasonParameter

Seeker
type: ObjectProperty
type: Property
comment: The organization seeking an offer.
domain: Offer
range: Organization
term status: stable
equivalent property: seeker

Selected Products Only
type: Property
type: DatatypeProperty
comment: If specified and set to true, the discount only applies to specific products selected by the retailer or offer promoter - not to all items in that product category. This property should be asserted and set to true for offers that say 'on selected products'.
domain: Discount
range: boolean
term status: stable
equivalent property: selectedProductsOnly

Selenium Per Nutrient Basis Quantity
type: Property
type: ObjectProperty
comment: Selenium per specified nutrient basis quantity.
domain: Food Beverage Tobacco Product
range: Nutrition Measurement Type
term status: stable
equivalent property: seleniumPerNutrientBasis

16
type: ObjectProperty
type: Property
comment: The date specified by the manufacturer as the last date the retailer is to offer the product for sale to the consumer. The product should not be merchandised after this date.
domain: Product
label: Sell By Date
range: date
notation: 16
term status: stable
equivalent property: sellByDate

Seller
type: ObjectProperty
type: Property
comment: The organization seeking to sell a product or service.
domain: Offer
range: Organization
term status: stable
equivalent property: seller

Service information
type: Property
type: ObjectProperty
comment: A link to service or maintenance instructions.
domain: Thing
range: anyURI
sub property of: Link Type
term status: stable
equivalent property: serviceInfo

Serving Size
type: Property
type: ObjectProperty
comment: Measurement value specifying the serving size in which the information per nutrient has been stated. Example: Per 100 GRM.
domain: Food Beverage Tobacco Product
range: Measurement Type
term status: stable
equivalent property: servingSize

Serving Size Description
type: DatatypeProperty
type: Property
comment: A free text field specifying the serving size for which the nutrient information has been stated for example: per 1/3 cup (42 g).
domain: Food Beverage Tobacco Product
range: langString
term status: stable
equivalent property: servingSizeDescription

Serving Suggestion
type: DatatypeProperty
type: Property
comment: Free text field for serving suggestion.
domain: Food Beverage Tobacco Product
range: langString
term status: stable
equivalent property: servingSuggestion

Sharpness Of Cheese
type: ObjectProperty
type: Property
comment: The descriptive term that is used by the product manufacturer to identify the sharpness of the taste of the product for example EXTRA_SHARP. Usually the longer the aging of the product, the sharper the taste.
domain: Milk Butter Cream Yogurt Cheese Eggs Substitutes
range: Sharpness of Cheese Code
term status: stable
equivalent property: sharpnessOfCheese

Site Access Requirements
type: Property
type: DatatypeProperty
comment: A URI value linking to information related to requirements for accessing or visiting a place.
domain: Place
range: anyURI
term status: stable

Size
type: Property
type: ObjectProperty
comment: Links a wearable product to one or more groupings of gs1:SizeDetails representing size systems, size groups, size type and size dimensions.
domain: Wearable Product
range: Size Details
term status: stable
equivalent property: size

Size Code
type: Property
type: ObjectProperty
comment: Links a product to one or more groupings of gs1:SizeCodeDetails representing the size value from a specified code list.
domain: Product
range: Size Code Details
term status: stable
equivalent property: sizeCode

Size Code List Code
type: Property
type: DatatypeProperty
comment: Code specifying a size code list. Allowed code values are specified in GS1 Code List SizeCodeListCode .
domain: Size Code Details
range: string
term status: stable
equivalent property: sizeCodeListCode

Size Code
type: Property
type: DatatypeProperty
comment: A code indicating the size of an object according to a specific code list. The applied code list is specified as additional information together with the size code.
domain: Size Code Details
range: string
term status: stable
equivalent property: sizeCodeValue

Size Dimension
type: ObjectProperty
type: Property
comment: The numerical size measurement relating to the size type.
domain: Size Details
range: Measurement Type
term status: stable
equivalent property: sizeDimension

Size Group
type: Property
type: ObjectProperty
comment: Code indicating the type of size that is necessary to uniquely specify the size of the item, for example, BOYS.
domain: Size Details
range: Size Group Code
term status: stable
equivalent property: sizeGroup

Size System
type: Property
type: ObjectProperty
comment: The system that is being used to define the size for example EUROPE. Size system is used in conjunction with size group to define the size dimension.
domain: Size Details
range: Size System Code
term status: stable
equivalent property: sizeSystem

Size Type
type: ObjectProperty
type: Property
comment: The type of size dimension being specified for example SLEEVE.
domain: Size Details
range: Size Type Code
term status: stable
equivalent property: sizeType

SmartLabel
type: Property
type: ObjectProperty
comment: A link to the product's SmartLabel page.
domain: Thing
range: anyURI
sub property of: Link Type
term status: stable
equivalent property: smartLabel

Summary Product Characteristics (SmPC)
type: Property
type: ObjectProperty
comment: A link to Summary Product Characteristics. To be used specifically when linking to information for healthcare professionals.
domain: Thing
range: anyURI
sub property of: Link Type
term status: stable
restricted: validatedHealthcare
equivalent property: smpc

Social media
type: Property
type: ObjectProperty
comment: A link to a social media channel. The title will typically be replaced by the name of the channel.
domain: Thing
range: anyURI
sub property of: Link Type
term status: stable
equivalent property: socialMedia

Sodium Per Nutrient Basis Quantity
type: ObjectProperty
type: Property
comment: Sodium per specified nutrient basis quantity.
domain: Food Beverage Tobacco Product
range: Nutrition Measurement Type
term status: stable
equivalent property: sodiumPerNutrientBasis

Source Animal Code
type: Property
type: ObjectProperty
comment: Code indicating the source of raw material used to produce the food product, for example a GOAT for milk.
domain: Food Beverage Tobacco Product
range: Source Animal Code
term status: stable
equivalent property: sourceAnimal

Sporting Activity Type
type: Property
type: ObjectProperty
comment: Code indicating the type of sporting activity for which the product is intended to be worn, for example FOOTBALL.
domain: Wearable Product
range: Sporting Activity Type Code
term status: stable
equivalent property: sportingActivityType

Starch Per Nutrient Basis Quantity
type: Property
type: ObjectProperty
comment: Starch per specified nutrient basis quantity.
domain: Food Beverage Tobacco Product
range: Nutrition Measurement Type
term status: stable
equivalent property: starchPerNutrientBasis

Statistics
type: Property
type: ObjectProperty
comment: A link to information about statistics regarding an organisation, location, or other entity.
domain: Thing
range: anyURI
sub property of: Link Type
term status: stable
equivalent property: statisticInfo

Status Timestamp
type: Property
type: DatatypeProperty
comment: Date and time (including optional timezone) associated to status designations. Timestamps may be future dated to provide advance notice of status changes. For further information about the required lexical representation of date, time, and timezone please see https://www.w3.org/TR/xmlschema-2/#dateTime
domain: Class
  union of: Organisation Status History
  union of: Location Status History
range: dateTime
term status: stable
equivalent property: statusTimestamp

Street Address
type: Property
type: DatatypeProperty
comment: The street address expressed as free form text. The street address is printed on paper as the first lines below the name. For example, the name of the street and the number in the street or the name of a building. A total of four street address lines are available. gs1:streetAddress SHOULD be used before populating lines two through four. For a PO Box gs1:postOfficeBoxNumber SHOULD be used instead.
domain: Address
range: langString
term status: stable
equivalent property: streetAddress

Street Address Line 2
type: Property
type: DatatypeProperty
comment: The second line of the street address, expressed as free form text. The street address is printed on paper as the first lines below the name. For example, the name of the street and the number in the street or the name of a building. A total of four street address lines are available. gs1:streetAddress SHOULD be used before populating lines two through four. These SHALL NOT be used as alternatives to the dedicated address properties gs1:addressSuburb, gs1:addressLocality and gs1:addressRegion.
domain: Address
range: langString
term status: stable
equivalent property: streetAddressLine2

Street Address Line 3
type: Property
type: DatatypeProperty
comment: The third line of the street address, expressed as free form text. The street address is printed on paper as the first lines below the name. For example, the name of the street and the number in the street or the name of a building. A total of four street address lines are available. gs1:streetAddress and gs1:streetaddressLine2 SHOULD be used before populating lines three and four. These SHALL NOT be used as alternatives to the dedicated address properties gs1:addressSuburb, gs1:addressLocality and gs1:addressRegion.
domain: Address
range: langString
term status: stable
equivalent property: streetAddressLine3

Street Address Line 4
type: Property
type: DatatypeProperty
comment: The fourth line of the street address, expressed as free form text. The street address is printed on paper as the first lines below the name. For example, the name of the street and the number in the street or the name of a building. gs1:streetAddress, gs1:streetaddressLine2 and gs1:streetaddressLine3 SHOULD be used before populating line four. These SHALL NOT be used as alternatives to the dedicated address properties gs1:addressSuburb, gs1:addressLocality and gs1:addressRegion.
domain: Address
range: langString
term status: stable
equivalent property: streetAddressLine4

Style Description
type: Property
type: DatatypeProperty
comment: An attribute that classifies products that share many of the same characteristics (attribute values) that does NOT vary by GTIN, and are presented by the supplier as a single merchandise selection for the buyer.
domain: Wearable Product
range: langString
term status: stable
equivalent property: styleDescription

Sub-brand Name
type: Property
type: DatatypeProperty
comment: Second level of brand. Can be a trademark. It is the primary differentiating factor that a brand owner wants to communicate to the consumer or buyer. E.g. Yummy-Cola Classic. In this example Yummy-Cola is the brand and Classic is the sub-brand.
domain: Brand
range: langString
sub property of: name
related: Brand
term status: stable
equivalent property: subBrandName

Sub-Organization
type: Property
type: ObjectProperty
comment: Designates a legal entity or function directly below the organisation/party being identified in a hierarchy. There may be multiple sub-organisations associated to a single GLN. To specify other affiliated organisations, see gs1:manages, gs1:franchisorOf, gs1:owns. To specify a parent organisation, see gs1:parentOrganization.
domain: Organization
range: Organization
term status: stable
equivalent property: subOrganization

Subscribe
type: Property
type: ObjectProperty
comment: A link to a subscription form
domain: Thing
range: anyURI
sub property of: Link Type
term status: stable
equivalent property: subscribe

Sugars Per Nutrient Basis Quantity
type: ObjectProperty
type: Property
comment: Sugars per specified nutrient basis quantity.
domain: Food Beverage Tobacco Product
range: Nutrition Measurement Type
term status: stable
equivalent property: sugarsPerNutrientBasis

Supplier Specified Minimum Consumer Storage Days
type: Property
type: DatatypeProperty
comment: Represents the number of days between a product's sell by date and its use by date.
domain: Product
range: integer
term status: stable
equivalent property: supplierSpecifiedMinimumConsumerStorageDays

Support
type: Property
type: ObjectProperty
comment: A link to a source of support such as a helpdesk, chat support, email etc.
domain: Thing
range: anyURI
sub property of: Link Type
term status: stable
equivalent property: support

Sustainability and recycling
type: Property
type: ObjectProperty
comment: A link to information relating to sustainability and recycling requirements or processes.
domain: Thing
range: anyURI
sub property of: Link Type
term status: stable
equivalent property: sustainabilityInfo

Sweetness level of alcoholic beverage
type: ObjectProperty
type: Property
comment: Indicates the descriptive term that is used by the product manufacturer to identify the sweetness of the alcoholic beverage. These are sometimes placed on a label. In some markets, the term is based on the amount of sugar content according to local regulation.
domain: Beverage
range: Sweetness level of alcoholic beverage
term status: stable
equivalent property: sweetnessLevelOfAlcoholicBeverage

Target Consumer Age
type: DatatypeProperty
type: Property
comment: Identifies the target consumer age range for which a product has been designed.
domain: Wearable Product
range: string
term status: stable
equivalent property: targetConsumerAge

Target Consumer Gender
type: ObjectProperty
type: Property
comment: Identifies the target consumer gender for which a product has been designed for example MALE
domain: Wearable Product
range: Target Consumer Gender Code
term status: stable
equivalent property: targetConsumerGender

Has Target Market
type: ObjectProperty
type: Property
comment: Relates to a set of target market details (product release date and associated countries)
domain: Product
range: Target Market Details
term status: stable
equivalent property: targetMarket

Target Market Countries
type: Property
type: ObjectProperty
comment: List of countries representing the target market for a particular release date indicated by gs1:consumerFirstAvailabilityDateTime
domain: Target Market Details
range: Country
term status: stable
equivalent property: targetMarketCountries

Telephone
type: DatatypeProperty
type: Property
comment: A telephone number for example +44 217 992 9999.
domain: Contact
range: string
term status: stable
equivalent property: telephone

Has Textile Material
type: ObjectProperty
type: Property
comment: One or more links to information about the materials used in a wearable product.
domain: Clothing
range: Textile Material
term status: stable
equivalent property: textileMaterial

Textile Material Content
type: Property
type: DatatypeProperty
comment: A description of the material composition used in conjunction with the material percentage.
domain: Wearable Product
range: langString
term status: stable
equivalent property: textileMaterialContent

Textile Description
type: DatatypeProperty
type: FunctionalProperty
type: Property
comment: This provides a name or brief description of one material contained within the product, for example Rayon.
domain: Textile Material
range: langString
term status: stable
equivalent property: textileMaterialDescription

Textile Material Percentage
type: Property
type: FunctionalProperty
type: DatatypeProperty
comment: Corresponding net weight percentage of the product material specified via gs1:textileMaterialDescription, e.g. 70.
domain: Textile Material
range: float
term status: stable
equivalent property: textileMaterialPercentage

Textile Material Thread Count
type: Property
type: FunctionalProperty
type: DatatypeProperty
comment: The quality of material (fabric) of a product based on the total number of vertical and horizontal threads in one square inch.
domain: Textile Material
range: langString
term status: stable
equivalent property: textileMaterialThreadCount

Textile Material Weight
type: FunctionalProperty
type: ObjectProperty
type: Property
comment: The measured weight of the material expressed in ounces per square yard or grams per square meter.
domain: Textile Material
range: Measurement Type
term status: stable
equivalent property: textileMaterialWeight

Thiamin Per Nutrient Basis Quantity
type: Property
type: ObjectProperty
comment: Thiamin per specified nutrient basis quantity.
domain: Food Beverage Tobacco Product
range: Nutrition Measurement Type
term status: stable
equivalent property: thiaminPerNutrientBasis

Traceability information
type: Property
type: ObjectProperty
comment: A link to traceability information (includes track and trace). Traceability information may be provided for consumption by humans or computers. If the target is an EPCIS repository, use gs1:epcis instead.
domain: Thing
range: anyURI
sub property of: Link Type
term status: stable
equivalent property: traceability

Trans Fat Per Nutrient Basis Quantity
type: Property
type: ObjectProperty
comment: Trans Fat per specified nutrient basis quantity.
domain: Food Beverage Tobacco Product
range: Nutrition Measurement Type
term status: stable
equivalent property: transFatPerNutrientBasis

Transaction Date
type: Property
type: DatatypeProperty
comment: The date associated with a business transaction
domain: Transaction
range: date
term status: provisional

Transaction Reference
type: Property
type: DatatypeProperty
comment: An identifier for a business transactions
domain: Transaction
range: string
term status: provisional

Transaction Reference
type: Property
type: ObjectProperty
comment: The code indicating the type of business transactions
domain: Transaction
range: Transaction Type
term status: provisional

Tutorial
type: Property
type: ObjectProperty
comment: A link to a tutorial or set of tutorials, such as online classes, how-to videos etc.
domain: Thing
range: anyURI
sub property of: Link Type
term status: stable
equivalent property: tutorial

Measurement Unit
type: Property
type: DatatypeProperty
comment: A string value indicating a Measurement Unit from UN/ECE Recommendation 20, Units of Measure used in International Trade e.g. GRM = gram - see http://www.unece.org/fileadmin/DAM/cefact/recommendations/rec20/rec20_rev3_Annex3e.pdf
domain: Measurement Type
range: string
term status: stable
equivalent property: unitCode

Has Upper Material
type: ObjectProperty
type: Property
comment: The material(s) used for the upper part of the footwear product. The upper is the part of a shoe, boot, slipper or other item of footwear that is above the sole.
domain: Footwear
range: Textile Material
term status: stable
equivalent property: upperMaterialType

Sign waiver/agreement/document
type: Property
type: ObjectProperty
comment: A link to an agreement or waiver.
domain: Thing
range: anyURI
sub property of: Link Type
term status: stable
equivalent property: userAgreement

Uses managed location
type: ObjectProperty
type: Property
comment: Links to the place(s) that this organisation uses as a managed space.
domain: Organization
range: Place
term status: stable
equivalent property: usesManagedLocation

Valid From
type: Property
type: DatatypeProperty
comment: The effective start date of the price .
domain: Price Specification
range: dateTime
term status: stable
equivalent property: validFrom

Valid Through
type: Property
type: DatatypeProperty
comment: The effective end date of the price .
domain: Price Specification
range: dateTime
term status: stable
equivalent property: validThrough

Measurement Value
type: Property
type: DatatypeProperty
comment: A floating-point numeric value that is qualified by the corresponding measurement unit code - see gs1:unitCode
domain: Measurement Type
range: float
term status: stable
equivalent property: value

Variant Description
type: DatatypeProperty
type: Property
comment: Free text field used to identify the variant of the product. Variants are the distinguishing characteristics that differentiate products with the same brand and size including such things as the particular flavour, fragrance, taste.
domain: Product
range: langString
term status: stable
equivalent property: variantDescription

Verification Service
type: Property
type: ObjectProperty
comment: A link to a GS1 Lightweight Messaging Service for verifying the status of a product, organisation, or location and its identifier.
domain: Thing
range: anyURI
sub property of: Link Type
term status: stable
equivalent property: verificationService

Vintner
type: Property
type: DatatypeProperty
comment: The person hired by a winery or wine company who is responsible for many of the processes in the preparation, taste and quality of the wine produced. The science of wine making is referred to as oenology. The vintner is the oenologist.
domain: Beverage
range: langString
term status: stable
equivalent property: vintner

Vitamin A Per Nutrient Basis Quantity
type: ObjectProperty
type: Property
comment: Vitamin A per specified nutrient basis quantity.
domain: Food Beverage Tobacco Product
range: Nutrition Measurement Type
term status: stable
equivalent property: vitaminAPerNutrientBasis

Vitamin B12 Per Nutrient Basis Quantity
type: ObjectProperty
type: Property
comment: Vitamin B12 per specified nutrient basis quantity.
domain: Food Beverage Tobacco Product
range: Nutrition Measurement Type
term status: stable
equivalent property: vitaminB12PerNutrientBasis

Vitamin B6 Per Nutrient Basis Quantity
type: Property
type: ObjectProperty
comment: Vitamin B6 per specified nutrient basis quantity.
domain: Food Beverage Tobacco Product
range: Nutrition Measurement Type
term status: stable
equivalent property: vitaminB6PerNutrientBasis

Vitamin C Per Nutrient Basis Quantity
type: Property
type: ObjectProperty
comment: Vitamin C per specified nutrient basis quantity.
domain: Food Beverage Tobacco Product
range: Nutrition Measurement Type
term status: stable
equivalent property: vitaminCPerNutrientBasis

Vitamin D Per Nutrient Basis Quantity
type: Property
type: ObjectProperty
comment: Vitamin D per specified nutrient basis quantity.
domain: Food Beverage Tobacco Product
range: Nutrition Measurement Type
term status: stable
equivalent property: vitaminDPerNutrientBasis

Vitamin E Per Nutrient Basis Quantity
type: ObjectProperty
type: Property
comment: Vitamin E per specified nutrient basis quantity.
domain: Food Beverage Tobacco Product
range: Nutrition Measurement Type
term status: stable
equivalent property: vitaminEPerNutrientBasis

Vitamin K Per Nutrient Basis Quantity
type: ObjectProperty
type: Property
comment: Vitamin K per specified nutrient basis quantity.
domain: Food Beverage Tobacco Product
range: Nutrition Measurement Type
term status: stable
equivalent property: vitaminKPerNutrientBasis

Warning Copy Description
type: DatatypeProperty
type: Property
comment: Warning information is additional information that outlines special requirements, warning and caution information printed on the package.
domain: Product
range: langString
term status: stable
equivalent property: warningCopyDescription

Has Offer Warranty
type: ObjectProperty
type: Property
comment: The warranty associated with the product, as provided by the manufacturer.
domain: Offer
range: Warranty
sub property of: warranty
term status: stable
equivalent property: warranty

Warranty Scope
type: DatatypeProperty
type: Property
comment: The description of warranty available for the product. Allows for the representation of the same value in different languages but not for multiple values.
domain: Warranty
range: langString
sub property of: description
term status: stable
equivalent property: warrantyScopeDescription

What's in the box?
type: Property
type: ObjectProperty
comment: A link to a description of all the individual items in a packaged item.
domain: Thing
range: anyURI
sub property of: Link Type
term status: stable
equivalent property: whatsInTheBox

Yield
type: Property
type: ObjectProperty
comment: Product quantity after preparation.
domain: Food and Beverage Preparation Information
range: Product Yield Details
term status: stable
equivalent property: yield

Zinc Per Nutrient Basis Quantity
type: ObjectProperty
type: Property
comment: Zinc per specified nutrient basis quantity.
domain: Food Beverage Tobacco Product
range: Nutrition Measurement Type
term status: stable
equivalent property: zincPerNutrientBasis

Allergen Type Code
subclass of: Type Code
equivalent class: AllergenTypeCode

Anatomical Form Code
subclass of: Type Code
equivalent class: AnatomicalFormCode

Business Entity Type
subclass of: Type Code
equivalent class: BusinessEntityType

Certification Status Code
comment: A set of codes for the status of a certification instance
subclass of: Type Code
equivalent class: CertificationStatus

Cheese Firmness Code
subclass of: Type Code
equivalent class: CheeseFirmnessCode

Colour Code List Code
subclass of: Type Code
equivalent class: ColourCodeListCode

Compulsory Additional Label Information Type Code
comment: The code indicating the type of the legally required/compulsory additional information that is stated on the product packaging or label.
subclass of: Type Code
equivalent class: CompulsoryAdditionalLabelInformationTypeCode

Consumer Lifestage Code
subclass of: Type Code
equivalent class: ConsumerLifestageCode

Consumer Sales Conditions Code
subclass of: Type Code
equivalent class: ConsumerSalesConditionsCode

Contact Role Type
subclass of: Type Code
term status: stable
equivalent class: ContactRoleType

Diet Type Code
subclass of: Type Code
equivalent class: DietTypeCode

Discount Type Code
subclass of: Type Code
equivalent class: DiscountTypeCode

Food Beverage Refrigeration Claim Code
subclass of: Type Code
equivalent class: FoodBeverageRefrigerationClaimCode

Food Beverage Target Use Code
subclass of: Type Code
equivalent class: FoodBeverageTargetUseCode

Footwear Fastening Type Code
subclass of: Type Code
equivalent class: FootwearFasteningTypeCode

Fresh Or Seawater Farmed Code
subclass of: Type Code
equivalent class: FreshOrSeawaterFarmedCode

GLN Type Code
comment: GLN Type Code indicates what type of thing is being identified by a GLN. gs1:GLN_TypeCode value selections SHALL NOT contain both gs1:GLN_TypeCode-FIXED_PHYSICAL_LOCATION and gs1:GLN_TypeCode-MOBILE_PHYSICAL_LOCATION.
subclass of: Type Code
equivalent class: GLN TypeCode

Growing Method Code
subclass of: Type Code
equivalent class: GrowingMethodCode

Level Of Containment Code
subclass of: Type Code
equivalent class: LevelOfContainmentCode

Location ID Type
subclass of: Type Code
equivalent class: LocationID Type

Location Role Code
comment: Indicates the role and/or purpose of a location (i.e., fixed or mobile physical location or digital location) identified with a GLN.
subclass of: Type Code
equivalent class: LocationRoleType

Maturation Method Code
subclass of: Type Code
equivalent class: MaturationMethodCode

Measurement Precision Code
subclass of: Type Code
equivalent class: MeasurementPrecisionCode

Measurement type
comment: A set of measurement types for properties that can be measured or sensed by appropriate measuring devices or sensors
subclass of: Type Code
equivalent class: MeasurementType

Nonbinary Logic Code
subclass of: Type Code
equivalent class: NonbinaryLogicCode

Nutrient Basis Quantity Code
subclass of: Type Code
equivalent class: NutrientBasisQuantityCode

Nutritional Claim Type Code
subclass of: Type Code
equivalent class: NutritionalClaimTypeCode

Offer Redemption Type Code
subclass of: Type Code
equivalent class: OfferRedemptionTypeCode

Organic Claim Agency Code
subclass of: Type Code
equivalent class: OrganicClaimAgencyCode

Organization ID Type
subclass of: Type Code
equivalent class: OrganizationID Type

Organization Role Code
subclass of: Type Code
equivalent class: OrganizationRoleType

Packaging Feature Code
subclass of: Type Code
equivalent class: PackagingFeatureCode

Packaging Function Code
subclass of: Type Code
equivalent class: PackagingFunctionCode

Packaging Marked Diet Allergen Code
subclass of: Type Code
equivalent class: PackagingMarkedDietAllergenCode

Packaging Marked Free From Code
subclass of: Type Code
equivalent class: PackagingMarkedFreeFromCode

Packaging Marked Label Accreditation Code
subclass of: Type Code
equivalent class: PackagingMarkedLabelAccreditationCode

Packaging Material Type Code
subclass of: Type Code
equivalent class: PackagingMaterialTypeCode

Packaging Recycling Process Type Code
subclass of: Type Code
equivalent class: PackagingRecyclingProcessTypeCode

Packaging Recycling Scheme Code
subclass of: Type Code
equivalent class: PackagingRecyclingSchemeCode

Packaging Shape Code
subclass of: Type Code
equivalent class: PackagingShapeCode

Payment Method Code
comment: A code indicating an accepted method of payment
subclass of: Type Code
equivalent class: PaymentMethod

Preparation Type Code
comment: A code indicating a method of preparation of a food or beverage product
subclass of: Type Code
equivalent class: PreparationTypeCode

Preservation Technique Code
subclass of: Type Code
equivalent class: PreservationTechniqueCode

Product Yield Type Code
subclass of: Type Code
equivalent class: ProductYieldTypeCode

Referenced File Type Code
subclass of: Type Code
equivalent class: ReferencedFileTypeCode

Regulation Type Code
comment: The code indicating a type of regulation.
subclass of: Type Code
term status: provisional

Regulatory Identifier Type
comment: A code indicating the regulatory purpose of a referenced record, document or dataset.
subclass of: Type Code
term status: provisional

Season Parameter Code
subclass of: Type Code
equivalent class: SeasonParameterCode

Security Marking code list
subclass of: Type Code
equivalent class: SecurityMarking

Sensor Alert Type
comment: A code list for reasons for generating a sensor alert, including an alarm condition or an error condition
subclass of: Type Code
equivalent class: SensorAlertType

Sharpness of Cheese Code
subclass of: Type Code
equivalent class: SharpnessOfCheeseCode

Size Group Code
subclass of: Type Code
equivalent class: SizeGroupCode

Size System Code
subclass of: Type Code
equivalent class: SizeSystemCode

Size Type Code
subclass of: Type Code
equivalent class: SizeTypeCode

Source Animal Code
subclass of: Type Code
equivalent class: SourceAnimalCode

Sporting Activity Type Code
subclass of: Type Code
equivalent class: SportingActivityTypeCode

Status Type
subclass of: Type Code
equivalent class: StatusType

Sweetness level of alcoholic beverage
subclass of: Type Code
term status: stable
equivalent class: SweetnessLevelOfAlcoholicBeverageCode

Target Consumer Gender Code
subclass of: Type Code
equivalent class: TargetConsumerGenderCode

Trade Channel Code
subclass of: Type Code
equivalent class: TradeChannelCode

Transaction Type
comment: A code indicating the type or purpose of a transaction identifier.
subclass of: Type Code
term status: provisional

Upper Type Code
subclass of: Type Code
equivalent class: UpperTypeCode

ALARM_CONDITION
type: Sensor Alert Type
label: Alarm condition
comment: Indicates the reporting of an alarm condition detected by a sensor device

AbsoluteHumidity
type: Measurement type
label: Absolute humidity
comment: The ratio of the mass of water vapour in a sample of moist air to the volume of the sample. SI Units: kilogram per cubic metre

AbsorbedDose
type: Measurement type
label: Absorbed dose
comment: The energy absorbed per unit mass of the patient from the decay of a radionuclide given to a patient for diagnostic or therapeutic purposes. SI Units: gray

AbsorbedDoseRate
type: Measurement type
label: Absorbed dose rate
comment: The energy absorbed per unit time per unit mass of the patient from the decay of a radionuclide given to a patient for diagnostic or therapeutic purposes. SI Units: gray per second

Acceleration
type: Measurement type
comment: The rate of change of velocity, a vector quantity with magnitude and direction. SI Units: metre per second per second

1,3-BIS-(2,4-DIAMINOPHENOXY)PROPANE
type: Allergen Type Code
Original Code Value: BR
comment: Refers to the presence of 1,3-Bis-(2,4-diaminophenoxy)propane as listed in the regulations specified in AllergenSpecificationAgency and AllergenSpecificationName.
label: 1,3-Bis-(2,4-diaminophenoxy)propane
deprecated: BR

1-NAPHTHOL
type: Allergen Type Code
Original Code Value: ON
comment: Refers to the presence of 1-Naphthol as listed in the regulations specified in AllergenSpecificationAgency and AllergenSpecificationName.
label: 1-Naphthol
deprecated: ON

2,6-DIMETHOXY-3,5-PYRIDINEDIAMINE_HCL
type: Allergen Type Code
Original Code Value: DA
comment: Refers to the presence of 2,6-Dimethoxy-3,5-pyridinediamine HCl as listed in the regulations specified in AllergenSpecificationAgency and AllergenSpecificationName.
label: 2,6-Dimethoxy-3,5-pyridinediamine HCl
deprecated: DA

2-HYDROXYETHYL-PICRAMIC_ACID
type: Allergen Type Code
Original Code Value: HP
comment: Refers to the presence of 2-Hydroxyethyl-picramic acid as listed in the regulations specified in AllergenSpecificationAgency and AllergenSpecificationName.
label: 2-Hydroxyethyl-picramic Acid
deprecated: HP

2-METHYL-5-HYDROXYETHYLAMINOPHENOL
type: Allergen Type Code
Original Code Value: MH
comment: Refers to the presence of 2-Methyl-5-hydroxyethylaminophenol as listed in the regulations specified in AllergenSpecificationAgency and AllergenSpecificationName.
label: 2-Methyl-5-hydroxyethylaminophenol
deprecated: MH

3-AMINO-2,4-DICHLOROPHENOL
type: Allergen Type Code
Original Code Value: AD
comment: Refers to the presence of 3-Amino-2,4-dichlorophenol as listed in the regulations specified in AllergenSpecificationAgency and AllergenSpecificationName.
label: 3-Amino-2,4-dichlorophenol
deprecated: AD

3-AMINOPHENOL
type: Allergen Type Code
Original Code Value: TA
comment: Refers to the presence of 3-Aminophenol as listed in the regulations specified in AllergenSpecificationAgency and AllergenSpecificationName.
label: 3-Aminophenol
deprecated: TA

4-AMINO-3-NITROPHENOL
type: Allergen Type Code
Original Code Value: FT
comment: Refers to the presence of 4-Amino-3-nitrophenol as listed in the regulations specified in AllergenSpecificationAgency and AllergenSpecificationName.
label: 4-Amino-3-nitrophenol
deprecated: FT

4-HYDROXY-PROPYLAMINO-3-NITROPHENOL
type: Allergen Type Code
Original Code Value: FH
comment: Refers to the presence of 4-Hydroxy-propylamino-3-nitrophenol as listed in the regulations specified in AllergenSpecificationAgency and AllergenSpecificationName.
label: 4-Hydroxy-propylamino-3-nitrophenol
deprecated: FH

AA
type: Allergen Type Code
Original Code Value: AA
comment: Refers to the presence of Amylcinnamyl Alcohol in the product. - CAS Registry Number: 101-85-9 - Also known as: alpha-Amylcinnamyl alcohol - Disclaimer: Refers to the presence of the allergen in the product, as listed in the regulations specified by an agency and specification or any local market regulations.
label: Amylcinnamyl alcohol

ABALONE
type: Allergen Type Code
Original Code Value: ABN
comment: Refers to the presence of Abalone and its derivatives in the product, as listed in the regulations specified in AllergenSpecificationAgency and AllergenSpecificationName.
label: Abalone and its Derivatives
deprecated: ABN

ABD
type: Allergen Type Code
Original Code Value: ABD
comment: Refers to the presence of Tuna and its derivatives in the product. - Family/Genus/Species: Scombridae subfamily Scombrinae/(various) - Also known as: Albacore, Bigeye Tuna, Black Skipjack, Blackfin Tuna, Bluefin Tuna, Bullet Tuna, Buri, Dogtooth Tuna, Escolar, Frigate Tuna, Kawakawa, Little Tuna, Longtail Tuna, Pacific Bluefin Tuna, Skipjack Tuna, Slender Tuna, Southern Bluefin Tuna, Spotted Tunny, Tuna, Yellowfin Tuna - Disclaimer: Refers to the presence of the allergen in the product, as listed in the regulations specified by an agency and specification or any local market regulations.
label: Tuna and its derivatives

ABE
type: Allergen Type Code
Original Code Value: ABE
comment: Refers to the presence of Walleye and its derivatives in the product. - Family/Genus/Species: Percidae/Sander/S. vitreus - Also known as: Walleye, Yellow Pike, Yellow Pickerel - Disclaimer: Refers to the presence of the allergen in the product, as listed in the regulations specified by an agency and specification or any local market regulations.
label: Walleye and its derivatives

ABF
type: Allergen Type Code
Original Code Value: ABF
comment: Refers to the presence of Barnacles and its derivatives in the product. - Family/Genus/Species: (various) - Also known as: Barnacle, Goose Barnacle, Leaf Barnacle, Pico - Disclaimer: Refers to the presence of the allergen in the product, as listed in the regulations specified by an agency and specification or any local market regulations.
label: Barnacle and its derivatives

ABG
type: Allergen Type Code
Original Code Value: ABG
comment: Refers to the presence of Crab and its derivatives in the product. - Family/Genus/Species: Brachyura (various) - Also known as: (various) - Disclaimer: Refers to the presence of the allergen in the product, as listed in the regulations specified by an agency and specification or any local market regulations.
label: Crab and its derivatives

ABH
type: Allergen Type Code
Original Code Value: ABH
comment: Refers to the presence of Crawfish and its derivatives in the product. - Family/Genus/Species: Astacidae or Cambaridae or Cambaroididae or Parastacidae/(various) - Also known as: Caribbean Spiny Lobster, Crawdad, Crawdaddy, Crawfish, Craydid, Crayfish, Freshwater Crayfish, Freshwater Lobsters, Marron, Mountain Lobsters, Mudbugs, Murray River Crayfish, Red Claw Crayfish, Red Swamp Crayfish, Rock Lobsters, Royal Spiny Lobster, White River Crayfish, Yabbie Crayfish - Disclaimer: Refers to the presence of the allergen in the product, as listed in the regulations specified by an agency and specification or any local market regulations.
label: Crawfish and its derivatives

ABI
type: Allergen Type Code
Original Code Value: ABI
comment: Refers to the presence of Krill and its derivatives in the product. - Family/Genus/Species: Euphausiacea (various) - Also known as: - Disclaimer: Refers to the presence of the allergen in the product, as listed in the regulations specified by an agency and specification or any local market regulations.
label: Krill and its derivatives

ABJ
type: Allergen Type Code
Original Code Value: ABJ
comment: Refers to the presence of Lobster and its derivatives in the product. - Family/Genus/Species: Nephropidae/(various) - Also known as: American Lobster, Blue Spiny Lobster, Blunt Slipper Lobster, Brazilian Slipper Lobster, California Spiny Lobster, Cape Spiny Lobster, Caribbean Lobsterette, Caribbean Spiny Lobster, Colorado Langostino, Common Spiny Lobster, Eastern Spiny Lobster, European Lobster, Flathead Locust Lobster, Florida Lobsterette, Gilchrist Spiny Lobster, Green Spiny Lobster, Hawaiian Spiny Lobster, Japanese Fan Lobster, Japanese Spiny Lobster, Lobsterette, Mud Spiny Lobster, Natal Spiny Lobster, Norway Lobster, Ornate Spiny Lobster, Painted Spiny Lobster, Pelagic Crab, Pink Spiny Lobster, Pronghorn Spiny Lobster, Red-banded Lobster, Ridged Slipper Lobster, Royal Spiny Lobster, Scalloped Spiny Lobster, Smoothtail Spiny Lobster, Southern Rock Lobster, Spanish Slipper Lobster, St. Paul Spiny Lobster, Swarming Squat Lobster, Urugavian Lobster, Western Red Lobster - Disclaimer: Refers to the presence of the allergen in the product, as listed in the regulations specified by an agency and specification or any local market regulations.
label: Lobster and its derivatives

ABK
type: Allergen Type Code
Original Code Value: ABK
comment: Refers to the presence of Prawns and its derivatives in the product. Prawn is a common name for small aquatic crustaceans with an exoskeleton and ten legs (which is a member of the order decapoda), some of which can be eaten. The terms shrimp and prawn are common names, not scientific names. They are vernacular or colloquial terms which lack the formal definition of scientific terms. They are not taxa, but are terms of convenience with little circumscriptional significance. There is no reason to avoid using the terms shrimp or prawn when convenient, but it is important not to confuse them with the names or relationships of actual taxa. - Family/Genus/Species: (various) - Also known as: Banana Prawn, Brown Tiger Prawn, Caramote Prawn, Common Prawn, Eastern King Prawn, Giant Freshwater Prawn, Giant Gamba Prawn, Giant Tiger Prawn, Green Tiger Prawn, Indian Prawn, Jack-knife Prawn, Kuruma Prawn, Redtail Prawn, Roshna Prawn, Western King Prawn, Prawn - Disclaimer: Refers to the presence of the allergen in the product, as listed in the regulations specified by an agency and specification or any local market regulations.
label: Prawns and its derivatives

ABL
type: Allergen Type Code
Original Code Value: ABL
comment: Refers to the presence of Shrimp and its derivatives in the product. The terms shrimp and prawn are common names, not scientific names. They are vernacular or colloquial terms which lack the formal definition of scientific terms. They are not taxa, but are terms of convenience with little circumscriptional significance. There is no reason to avoid using the terms shrimp or prawn when convenient, but it is important not to confuse them with the names or relationships of actual taxa. - Family/Genus/Species: (various) - Also known as: Akiami Paste Shrimp, Argentine Red Shrimp, Atlantic Seabob, Bigclaw River Shrimp, Blue Shrimp, Brown Rock Shrimp, Brown Shrimp, California Shrimp, Chinese White Shrimp, Cinnamon River Shrimp, Common Shrimp, Coonstriped Shrimp, Deep-water Rose Shrimp, Deep-water Rose Shrimp, Endeavour Shrimp, Golden Shrimp, Greasyback Shrimp, Humpy Shrimp, Jinga Shrimp, Kadal Shrimp, Kiddi Shrimp, Knife Shrimp, Kolibri Shrimp, Marsh Grass Shrimp, Northern Shrimp, Ocean Shrimp, Ohio Shrimp, Pink Shrimp, Pinkspotted Shrimp, Rainbow Shrimp, Royal Red Shrimp, Sakura Shrimp, Seven-spine Bay Shrimp, Sidestriped Shrimp, Smooth Nylon Shrimp, Southern Brown Shrimp, Southern White Shrimp, Speckled Shrimp, Spot Shrimp, Spot-tail Mantis Shrimp, Titi Shrimp, Western White Shrimp, White Shrimp, Whiteleg Shrimp, Tiger Shrimp, Shrimp - Disclaimer: Refers to the presence of the allergen in the product, as listed in the regulations specified by an agency and specification or any local market regulations.
label: Shrimp and its derivatives

ABN
type: Allergen Type Code
Original Code Value: ABN
comment: Refers to the presence of Abalone and its derivates in the product. - Family/Genus/Species: Haliotidae/Haliotis/(various) - Also known as: Abalone, Ear Shells, Sea Ears, Muttonfish, Muttonshells, Ormer, Perlemoen, Pāua, Australian Abalone, Blackfoot Abalone, Blacklip Abalone, Flat Abalone, Giant Abalone, Green Abalone, Greenlip Abalone, Pink Abalone, Pinto Abalone, Pourtale Abalone, Red Abalone, Roe's Abalone, Threaded Abalone, Tube Abalone - Disclaimer: Refers to the presence of the allergen in the product, as listed in the regulations specified by an agency and specification or any local market regulations.
label: Abalone and its derivatives

AC
type: Allergen Type Code
Original Code Value: AC
comment: Refers to the presence of Crustaceans and its derivates in the product - Family/Genus/Species: (Subphylum: Crustacea)/(various) - Also known as: (various) - Disclaimer: Refers to the presence of the allergen in the product, as listed in the regulations specified by an agency and specification or any local market regulations.
label: Crustaceans and its derivatives

ACP
type: Allergen Type Code
Original Code Value: ACP
comment: Refers to the presence of Carp and its derivatives in the product. - Family/Genus/Species: Cyprinidae /Cyprinus/(various) - Also known as: Banded Carpet Shell, Bighead Carp, Black Carp, Blue Morwong, Carp, Common Carp, Crucian Carp, Giant Barb, Golden Carpet Shell, Grass Carp, Grooved Carpet Shell, Large Razorbelly Minnow, Mola Carplet, Mottled Grouper, Mrigal, Mud Carp, Quillback, Reba Carp, River Carpsucker, Rockfish, Rudd, Silver Carp, Small Scaled Mud Carp, Smooth Nylon Shrimp, Ziege - Disclaimer: Refers to the presence of the allergen in the product, as listed in the regulations specified by an agency and specification or any local market regulations.
label: Carp and its derivatives

AD
type: Allergen Type Code
Original Code Value: AD
comment: Refers to the presence of 3-Amino-2,4-dichlorophenol in the product. - CAS Registry Number: 61693-42-3 - Also known as: - Disclaimer: Refers to the presence of the allergen in the product, as listed in the regulations specified by an agency and specification or any local market regulations.
label: 3-Amino-2,4-dichlorophenol

ADB
type: Allergen Type Code
Original Code Value: ADB
comment: Refers to the presence of Bass and its derivatives in the product. - Family/Genus/Species: Percichthyidae Macquaria novemaculeata/Serranidae Centropristis striata/Nototheniidae Dissostichus eleginoides/Polyprionidae Stereolepis gigas - Also known as: Akamutsu, Antarctic Toothfish, Argentine Sea Bass, Atlantic Creolefish, Bank Sea Bass, Barred Sand Bass, Black Crappie, Black Sea Bass, Blackfin Seabass, Blackmouth Bass, Blacktip Grouper, Choctaw Bass, Common Name, European Sea Bass, European Seabass, Giant Perch, Giant Sea Bass, Guadalupe Bass, Hapuka, Himalayan Glassy Perchlet, Japanese SeabassLargemouth Bass, Japanese Seaperch, Kelp Bass, Largemouth Bass, Longtail Bass, Meagre, Murray Cod, Northern Rockfish, Oscar, Ozark Bass, Pacific Creolefish, Palmetto Bass, Patagonian Toothfish, Peacock Cichlid, Peruvian Sea Bass, Red Drum, Roanoke Bass, Rock Bass, Rock Sea Bass, Sea Bass, Shortfin Corvina, Smallmouth Bass, Splittail Bass, Spotted Bass, Spotted Grouper, Spotted Sand Bass, Striped Bass, Sunshine Bass, Suwannee Bass, Tripletail, Warmouth, White Bass, White Crappie, White Seabass, Wreckfish, Yellow Bass - Disclaimer: Refers to the presence of the allergen in the product, as listed in the regulations specified by an agency and specification or any local market regulations.
label: Bass and its derivatives

ADC
type: Allergen Type Code
Original Code Value: ADC
comment: Refers to the presence of Anchovies and its derivatives in the product. - Family/Genus/Species: Engraulidae/(various) - Also known as: Anchoveta, Anchovy, Bay Anchovy, Deepbody Anchovy, Dusky Anchovy, European Anchovy, Flat Anchovy, Japanese Anchovy, Key Anchovy, Moustached Thryssa, New Jersey Anchovy, Northern Anchovy, Ramcarat Grenadier Anchovy, Round Headed Anchovy, Silver Anchovy, Slough Anchovy, Southern Anchovy, Striped Anchovy, Teri Anchovy - Disclaimer: Refers to the presence of the allergen in the product, as listed in the regulations specified by an agency and specification or any local market regulations.
label: Anchovy and its derivatives

ADE
type: Allergen Type Code
Original Code Value: ADE
comment: Refers to the presence of Catfish and its derivatives in the product. - Family/Genus/Species: (various) - Also known as: Asian Redtail Catfish, Atlantic Wolffish, Bagrid Catfish, Bagrid Catfishes, Black Bullhead, Blue Catfish, Broadhead Catfish, Brown Bullhead, Catfish, Channel Catfish, Couma Sea Catfish, Crucifix Sea Catfish, Flathead Catfish, Flatwhiskered Catfish, Gafftopsail Catfish, Giant Catfish, Giant River Catfish, Gilded Catfish, Gillbacker Sea Catfish, Glass Catfishes, Hardhead Catfish, Hardhead Sea Catfish, Highwaterman Catfish, Hybrid Clarias Catfish, Large Spotted Dogfish, Long Whiskered Catfish, Mekong Giant Catfish, Northern Wolffish, Pabdah Catfish, Pemecou Sea Catfish, Sharptooth Catfish, Spotted Stargazer, Spotted Wolffish, Stinging Catfish, Striped Dwarf Catfish, Sucker Catfishes, Sutchi Catfish, Tiger Sorubim, Walking Catfish, Wels Catfish, White Catfish, Yaqui Catfish, Yellowtail Catfish - Disclaimer: Refers to the presence of the allergen in the product, as listed in the regulations specified by an agency and specification or any local market regulations.
label: Catfish and its derivatives

ADF
type: Allergen Type Code
Original Code Value: ADF
comment: Refers to the presence of Cod and its derivatives in the product. - Family/Genus/Species: Gadidae/Gadus/(various) - Also known as: Arctic Cod, Atlantic Cod, Blue Antimora, Common Mora, Greenland Cod, Longfin Codling, Maori Cod, Northern Bastard Codling, Pacific Cod, Polar Cod, Red Cod, Rock Cod, Saffron Cod, Tadpole Mora, Toothed Cod - Disclaimer: Refers to the presence of the allergen in the product, as listed in the regulations specified by an agency and specification or any local market regulations.
label: Cod and its derivatives

ADG
type: Allergen Type Code
Original Code Value: ADG
comment: Refers to the presence of Flounder and its derivatives in the product. - Family/Genus/Species: Achiropsettidae or Bothidae or Pleuronectidae or Paralichthyidae or Samaridae/(various) - Also known as: Arctic Flounder, Arrowtooth Flounder, Bering Flounder, Bigmouth Flounder, Black Flounder, Blackback, Brill, Broad Flounder, California Flounder, Common Dab, Cortez Halibut, European Flounder, Eyed Flounder, Fivespot Flounder, Fluke, Fourspot Flounder, Fourspot Megrim, Greenback Flounder, Gulf Flounder, Indian Ocean Spiny Halibut, Kamchatka Flounder, Largetoothed Flounder, Longhead Dab, Megrim, Mexican Flounder, New Zealand Brill, Olive Flounder, Panther Flounder, Patagonian Flounder, Peacock Flounder, Pelican Flounder, Sand Flounder, Slime Flounder, Smalleye Flounder, Smalltoothed Flounder, Sohachi Flounder, Southern Flounder, Speckled Flounder, Starry Flounder, Summer Flounder, Three-eye Flounder, Threespot Righteye Flounder, Tropical Flounder, Windowpane, Winter Flounder, Witch, Witch Flounder, Yellowbelly Flounder, Yellowtail Flounder - Disclaimer: Refers to the presence of the allergen in the product, as listed in the regulations specified by an agency and specification or any local market regulations.
label: Flounder and its derivatives

ADH
type: Allergen Type Code
Original Code Value: ADH
comment: Refers to the presence of Grouper and its derivatives in the product. - Family/Genus/Species: Serranidae subfamily Epinephelina/(various) - Also known as: Banded Grouper, Black Grouper, Blacktip Grouper, Bridled Grouper, Broomtail Grouper, Brownspotted Rockcod, Camouflage Grouper, Chevron Tailed Grouper, Comb Grouper, Comet Grouper, Coney, Coral Hind, Dot-dash Grouper, Dusky Grouper, Dusty Tail Grouper, Gag, Giant Grouper, Goliath, Graysby, Greasy Rockcod, Grouper, Gulf Coney, Gulf Grouper, Halfmoon Grouper, Hawaiian Grouper, Highfin Grouper, Hong Kong Grouper, Leopard Coralgrouper, Longspine Grouper, Malabar Grouper, Marbled Grouper, Misty Grouper, Mottled Grouper, Nassau Grouper, Netfin Grouper, Oblique-banded Grouper, Orange-spotted Grouper, Persian Grouper, Purplespotted Grouper, Red Grouper, Red Hind, Redmouth Grouper, Sabah Grouper, Sand Perch, Scamp, Sixbar Grouper, Slender Grouper, Snowy Grouper, Snubnose Grouper, Speckled Blue Grouper, Speckled Dwarf Grouper, Spinycheek Grouper, Spotted Grouper, Squaretail Coralgrouper, Starspotted Grouper, Star-studded grouper, Strawberry Hind, Striped Grouper, Tiger Grouper, Tomato Hind, Warsaw Grouper, Wavy Lined Grouper, White Grouper, White-blotched Grouper, Yellowedge Grouper, Yellow-edged Lyretail, Yellowfin Grouper, Yellowmouth Grouper - Disclaimer: Refers to the presence of the allergen in the product, as listed in the regulations specified by an agency and specification or any local market regulations.
label: Grouper and its derivatives

ADI
type: Allergen Type Code
Original Code Value: ADI
comment: Refers to the presence of Haddock and its derivatives in the product. - Family/Genus/Species: Gadidae/Melanogrammus/Melanogrammus aeglefinus - Also known as: - Disclaimer: Refers to the presence of the allergen in the product, as listed in the regulations specified by an agency and specification or any local market regulations.
label: Haddock and its derivatives

ADJ
type: Allergen Type Code
Original Code Value: ADJ
comment: Refers to the presence of Hake and its derivatives in the product. - Family/Genus/Species: Merlucciidae or Phycidae or Gadidae subfamily Phycinae/(various) - Also known as: Argentine hake, Benguela hake, Brazilian Hake, Carolina Hake, Deep-water hake, European hake, Gayi hake, Gulf Hake, Longfin Hake, North Pacific hake, Offshore hake, Panama hake, Red Hake, Senegalese hake, Shallow-water hake, Silver hake, Southern Hake, Southern hake, Spotted Hake, White Hake - Disclaimer: Refers to the presence of the allergen in the product, as listed in the regulations specified by an agency and specification or any local market regulations.
label: Hake and its derivatives

ADK
type: Allergen Type Code
Original Code Value: ADK
comment: Refers to the presence of Halibut and its derivatives in the product. - FFamily/Genus/Species: Pleuronectidae/Hippoglossus/Hippoglossus hippoglossus or Hippoglossus stenolepis or Reinhardtius hippoglossoides - Also known as: Atlantic Halibut, Pacific Halibut, Greenland Halibut - Disclaimer: Refers to the presence of the allergen in the product, as listed in the regulations specified by an agency and specification or any local market regulations.
label: Halibut and its derivatives

ADL
type: Allergen Type Code
Original Code Value: ADL
comment: Refers to the presence of Herring and its derivatives in the product. - Family/Genus/Species: Clupeidae/Clupea/(various) - Also known as: African Ilisha, Araucanian herring, Atlantic Herring, Atlantic Thread Herring, Bigeye Ilisha, Blackstripe herring, Blueback Herring, Day's round herring, Deepbody Thread Herring, Denticle herring, Dogtooth herring, Dwarf round herring, Flatiron Herring, Galapagos thread herring, Gilchrist's round herring, Graceful herring, Indian Ilisha, Indian Pellona, Javan Ilisha, Little-eye round herring, Middling thread herring, Pacific Flatiron herring, Pacific Herring, Pacific thread herring, Panamanian Ilisha, Pugnose Ilisha, Red-eye round herring, Round Herring, Sanaga pygmy herring, Silver Darlings, Silver-stripe round herring, Skipjack Herring, Slender thread herring, Striped herring, Tardoore, Toothed river herring, Two-finned round herring, Venezuelan herring, West African pygmy herring, Whitehead's round herring - Disclaimer: Refers to the presence of the allergen in the product, as listed in the regulations specified by an agency and specification or any local market regulations.
label: Herring and its derivatives

ADM
type: Allergen Type Code
Original Code Value: ADM
comment: Refers to the presence of Mahi Mahi and its derivatives in the product. - Family/Genus/Species: Coryphaenidae/Coryphaena/C. hippurus - Also known as: Mahi, Mahi-Mahi, Common Dolphinfish, Dorado, Pompano Dolphin - Disclaimer: Refers to the presence of the allergen in the product, as listed in the regulations specified by an agency and specification or any local market regulations.
label: Mahi mahi and its derivatives

ADP
type: Allergen Type Code
Original Code Value: ADP
comment: Refers to the presence of Pike and its derivatives in the product. - Family/Genus/Species: Esocidae/Esox/(various) - Also known as: Pike, Pickerel, American Pickerel, Amur Pike, Aquitanian Pike, Chain Pickerel, Muskellunge, Northern Pike, Southern Pike, Grass Pike - Disclaimer: Refers to the presence of the allergen in the product, as listed in the regulations specified by an agency and specification or any local market regulations.
label: Pike and its derivatives

ADQ
type: Allergen Type Code
Original Code Value: ADQ
comment: Refers to the presence of Pollock and its derivatives in the product. - Family/Genus/Species: Gadidae/Pollachius/Pollachius pollachius or Pollachius virens - Also known as: Atlantic pollock, European pollock, Lieu Jaune, Lythe, Boston Blue, Silver Bill, Saithem Pollock, Pollack, Coley, Coalfish, Walleye Pollock - Disclaimer: Refers to the presence of the allergen in the product, as listed in the regulations specified by an agency and specification or any local market regulations.
label: Pollock and its derivatives

ADR
type: Allergen Type Code
Original Code Value: ADR
comment: Refers to the presence of Salmon and its derivatives in the product. - Family/Genus/Species: Salmonidae subfamily Salmoninae/(various) - Also known as: Atlantic salmon, Chinook salmon, Chum salmon, Coho salmon, Masu salmon, Pacific Salmon, Pink salmon, Sockeye salmon - Disclaimer: Refers to the presence of the allergen in the product, as listed in the regulations specified by an agency and specification or any local market regulations.
label: Salmon and its derivatives

ADS
type: Allergen Type Code
Original Code Value: ADS
comment: Refers to the presence of Snapper and its derivatives in the product. - Family/Genus/Species: Lutjanidae/(various) - Also known as: African Forktail Snapper, Amarillo Snapper, Black and White Snapper, Black Snapper, Blackfin Snapper, Blacktail Snapper, Bloodred Snapper, Blubberlip Snapper, Bluestriped Snapper, Cardinal Snapper, Caribbean Red Snapper, Chinamanfish, Colorado Snapper, Crimson Jobfish, Crimson Snapper, Cubera Snapper, Cunera Snapper, Dog Snapper, Emperor Snapper, Five-lined Snapper, Goldbanded Jobfish, Golden Snapper, Goldeneye Jobfish, Gold-striped Snapper, Gray Snapper, Green Jobfish, Humpback Snapper, John's Snapper, Lane Snapper, Lavender Jobfish, Mahogany Snapper, Malabar Snapper, Mangrove Red Snapper, Midnight Snapper, Mullet Snapper, Mutton Snapper, Oblique-banded Snapper, Onespot Snapper, Pacific Dog Snapper, Pacific Snapper, Pinjalo, Pink Snapper, Queen Snapper, Red Snapper, Rose Snapper, Ruby Snapper, Rufous Snapper, Rusty Jobfish, Saddleback Snapper, Sailfin Snapper, Sharptooth Jobfish, Silk Snapper, Smalltooth Jobfish, Snapper, Twinspot Snapper, Vermilion Snapper, Wenchman, Yellowstripe Snapper, Yellowtail Blue Snapper, Yellowtail Snapper - Disclaimer: Refers to the presence of the allergen in the product, as listed in the regulations specified by an agency and specification or any local market regulations.
label: Snapper and its derivatives

ADT
type: Allergen Type Code
Original Code Value: ADT
comment: Refers to the presence of Sole and its derivatives in the product. - Family/Genus/Species: Soleidae or Achiridae or Cynoglossidae or Pleuronectidae/(various) - Also known as: American Sole, Butter Sole, C-O Sole, Curlfin Sole, Deepsea Sole, Double-lined Tonguesole, Dover Sole, English Sole, Fantail Sole, Flathead Sole, Hogchoker, Lemon Sole, Milky Spotted Sole, Mud Sole, Naked Sole, Narrowbanded Sole, New Zealand Lemon Sole, Northern Rock Sole, Oriental Sole, Pacific Dover, Petrale Sole, Rex Sole, Roughscale Sole, Sand Sole, Scrawled Sole, Senegalese Sole, Slender Sole, Sole, Solenette, Southern Rock Sole, Thickback Sole, Toungue Sole, Tounguefish, West Coast Sole, Yellowfin Sole - Disclaimer: Refers to the presence of the allergen in the product, as listed in the regulations specified by an agency and specification or any local market regulations.
label: Sole and its derivatives

ADU
type: Allergen Type Code
Original Code Value: ADU
comment: Refers to the presence of Swordfish and its derivatives in the product. - FFamily/Genus/Species: Xiphiidae/Xiphias/X. gladius - Also known as: Swordfish, Broadbill - Disclaimer: Refers to the presence of the allergen in the product, as listed in the regulations specified by an agency and specification or any local market regulations.
label: Swordfish and its derivatives

ADV
type: Allergen Type Code
Original Code Value: ADV
comment: Refers to the presence of Tilapia and its derivatives in the product. - Family/Genus/Species: Cichlidae/Talapia or Coptodon or Oreochormis or Sarotherodon/(various) - Also known as: Talapia, Mozambique Talapia, Nile Talapia, Blue Talapia - Disclaimer: Refers to the presence of the allergen in the product, as listed in the regulations specified by an agency and specification or any local market regulations.
label: Tilapia and its derivatives

ADW
type: Allergen Type Code
Original Code Value: ADW
comment: Refers to the presence of Trout and its derivatives in the product. - Family/Genus/Species: Salmonida subfamily Salmoninae/Oncorhynchus or Salmo or Salvelinus- Also known as: Adriatic Trout, Alvord Cutthroat Trout, Apache Trout, Aurora Trout, Baja California Rainbow Trout, Beardslee Trout, Biwa Trout, Bonneville Cutthroat Trout, Brook Trout, Brown Trout, Bull Trout, Coastal Cutthroat Trout, Coastal Rainbow Trout (steelhead), Colorado River Cutthroat Trout, Columbia River Redband Trout, Crescenti Trout, Cutthroat Trout, Dolly Varden, Dolly Varden Trout, Eagle Lake Trout, Flathead Trout, Genus Oncorhynchus, Gila Trout, Golden Trout, Great Basin Redband Trout, Greenback Cutthroat Trout, Humboldt Cutthroat Trout, Inconnu, Kamchatkan Rainbow Trout, Kamloops Rainbow Trout, Kern River Rainbow Trout, Lacustrine Trout, Lahontan Cutthroat Trout, Lake Trout, Little Kern Golden Trout, Marble Trout, McCloud River Redband Trout, Mexican Golden Trout, Nelson's Trout, Ohrid Trout, Paiute Cutthroat Trout, Rainbow Trout, Rio Grande Cutthroat Trout, River Trout, Sacramento Golden Trout, San Pedro Martir Trout, Sea Trout, Sevan Trout, Sheepheaven Creek Redband Trout, Silver Trout, Snake River Fine-spotted Cutthroat Trout, Soca River Trout, Soča Trout, Speckled Lake (Splake) Trout, Tiger Trout, Trout, Westslope Cutthroat Trout, Whitehorse Basin Cutthroat Trout, Yellowstone Cutthroat Trout - Disclaimer: Refers to the presence of the allergen in the product, as listed in the regulations specified by an agency and specification or any local market regulations.
label: Trout and its derivatives

AE
type: Allergen Type Code
Original Code Value: AE
comment: Refers to the presence of eggs and its derivates in the product - Family/Genus/Species: - Also known as: Ovum - Disclaimer: Refers to the presence of the allergen in the product, as listed in the regulations specified by an agency and specification or any local market regulations.
label: Eggs and its derivatives

AF
type: Allergen Type Code
Original Code Value: AF
comment: Refers to the presence of Fish and its derivates in the product. - Family/Genus/Species: (various) - Also known as: (various) - Disclaimer: Refers to the presence of the allergen in the product, as listed in the regulations specified by an agency and specification or any local market regulations.
label: Fish and its derivatives

AH
type: Allergen Type Code
Original Code Value: AH
comment: Refers to the presence of Anise Alcohol in the product. - CAS Registry Number: 105-13-5 - Also known as: anisyl alcohol - Disclaimer: Refers to the presence of the allergen in the product, as listed in the regulations specified by an agency and specification or any local market regulations.
label: Anise Alcohol

AI
type: Allergen Type Code
Original Code Value: AI
comment: Refers to the presence of Alpha-Isomethyl Ionone in the product. - CAS Registry Number: 127-51-5 - Also known as: 3 Methyl-4-(2,6,6-trimethyl-2-cyclohexen-1-yl)-3-buten-2-on - Disclaimer: Refers to the presence of the allergen in the product, as listed in the regulations specified by an agency and specification or any local market regulations.
label: Alpha-Isomethyl Ionone

AJF
type: Allergen Type Code
Original Code Value: AJF
comment: Refers to the presence of Amberjack and its Derivatives in the product. - Family/Genus/Species: Carangidae/Seriola/(various) - Also known as: Amberjack, Buri, Greater amberjack, Lesser amberjack, Almaco jack, Yellowtail, Banded rudderfish - Disclaimer: Refers to the presence of the allergen in the product, as listed in the regulations specified by an agency and specification or any local market regulations.
label: Amberjack fish and its derivatives

AL
type: Allergen Type Code
Original Code Value: AL
comment: Refers to the presence of Amyl Cinnamal in the product. - CAS Registry Number: 122-40-7 - Also known as: alpha-amyl cinnamic aldehyde - Disclaimer: Refers to the presence of the allergen in the product, as listed in the regulations specified by an agency and specification or any local market regulations.
label: Amyl cinnamal

ALMONDS
type: Allergen Type Code
Original Code Value: SA
comment: Refers to the presence of almond and almond products as listed in the regulations specified in AllergenSpecificationAgency and AllergenSpecificationName.
label: Almond and Almond Products
deprecated: SA

ALPHA_ISOMETHYL_IONONE
type: Allergen Type Code
Original Code Value: AI
comment: Refers to the presence of Alpha-Isomethyl Ionone as listed in the regulations specified in AllergenSpecificationAgency and AllergenSpecificationName.
label: Alpha-Isomethyl Ionone
deprecated: AI

AM
type: Allergen Type Code
Original Code Value: AM
comment: Refers to the presence of milk and its derivatives in the product, as listed in in the product. - Family/Genus/Species: - Also known as: - Disclaimer: Refers to the presence of the allergen in the product, as listed in the regulations specified by an agency and specification or any local market regulations.
label: Milk and its derivatives

AMYLCINNAMYL_ALCOHOL
type: Allergen Type Code
Original Code Value: AA
comment: Refers to the presence of Amylcinnamyl Alcohol as listed in the regulations specified in AllergenSpecificationAgency and AllergenSpecificationName.
label: Amylcinnamyl Alcohol
deprecated: AA

AMYL_CINNAMAL
type: Allergen Type Code
Original Code Value: AL
comment: Refers to the presence of Amyl Cinnamal as listed in the regulations specified in AllergenSpecificationAgency and AllergenSpecificationName.
label: Amyl Cinnamal
deprecated: AL

AN
type: Allergen Type Code
Original Code Value: AN
comment: Refers to the presence of Tree nuts or nuts and its derivatives in the product. - Family/Genus/Species: Fagales. - Also known as: Nuts - Disclaimer: Refers to the presence of the allergen in the product, as listed in the regulations specified by an agency and specification or any local market regulations.
label: Tree nuts (Nuts) and its derivatives

ANCHOVY
type: Allergen Type Code
Original Code Value: ADC
comment: Refers to the presence of anchovies and their derivatives in the product, as listed as listed in the regulations specified in AllergenSpecificationAgency and AllergenSpecificationName.
label: Anchovy and its Derivatives
deprecated: ADC

ANISE_ALCOHOL
type: Allergen Type Code
Original Code Value: AH
comment: Refers to the presence of Anise Alcohol as listed in the regulations specified in AllergenSpecificationAgency and AllergenSpecificationName.
label: Anise Alcohol
deprecated: AH

ANO
type: Allergen Type Code
Original Code Value: ANO
comment: Refers to the presence of Perch and its derivatives in the product. - Family/Genus/Species: Percidae subfamily Percinae/Perca/(various) - Also known as: Acadian Redfish, Argentinian Sandperch, Barred Surfperch, Black Surfperch, Blue Cod, Calico Surfperch, Chilean Sandperch, Climbing Perch, Deepwater Redfish, Eurasian Perch, Golden Perch, Golden Redfish, Grass Goby, Namorado Sandperch, Nile Perch, Norway Redfish, Pacific Ocean Perch, Painted Comber, Pile Perch, Redtail Surfperch, Rockfish, Rubberlip Seaperch, Sandperch, Sauger, Shiner Surfperch, Silver Perch, Striped Surfperch, Thicktail Cardinalfish, Volga Pikeperch, Walleye Surfperch, White Perch, Yellow Perch, Zander, Zebra Perch - Disclaimer: Refers to the presence of the allergen in the product, as listed in the regulations specified by an agency and specification or any local market regulations.
label: Perch and its derivatives

AP
type: Allergen Type Code
Original Code Value: AP
comment: Refers to the presence of Peanuts and its derivatives in the product. - Family/Genus/Species: Arachis hypogaea. - Also known as: Groundnut, Goober, Pindar, Monkey nut. - Disclaimer: Refers to the presence of the allergen in the product, as listed in the regulations specified by an agency and specification or any local market regulations.
label: Peanuts and its derivatives

APL
type: Allergen Type Code
Original Code Value: APL
comment: Refers to the presence of Apple and its derivatives in the product. - Family/Genus/Species: Malus domestica. - Also known as: - Disclaimer: Refers to the presence of the allergen in the product, as listed in the regulations specified by an agency and specification or any local market regulations.
label: Apple and its derivatives

AS
type: Allergen Type Code
Original Code Value: AS
comment: Refers to the presence of Sesame seeds or its derivatives in the product, as listed in in the product - Family/Genus/Species: Sesamum. - Also known as: - Disclaimer: Refers to the presence of the allergen in the product, as listed in the regulations specified by an agency and specification or any local market regulations.
label: Sesame Seeds and its derivatives

ASD
type: Allergen Type Code
Original Code Value: ASD
comment: Refers to the presence of Aspartame and Aspartame-acesulfame salt in the product. - CAS Registry Number: 22839-47-0 - Also known as: - Disclaimer: Refers to the presence of the allergen in the product, as listed in the regulations specified by an agency and specification or any local market regulations.
label: Aspartame and aspartame-acesulfame salt and its derivatives

AU
type: Allergen Type Code
Original Code Value: AU
comment: Refers to the presence of sulfur dioxide and sulfits in the product. - CAS Registry Number: 7446-09-5 - Also known as: - Disclaimer: Refers to the presence of the allergen in the product, as listed in the regulations specified by an agency and specification or any local market regulations.
label: Sulfur Dioxide and Sulfits

AW
type: Allergen Type Code
Original Code Value: AW
comment: Refers to the presence of cereal grains containing gluten (protein) and their derivatives in the product. Includes wheat grains, grains that have been demonstrated capable of triggering celiac disease (such as common wheat, durum, spelt, khorasan, emmer and einkorn), barley, rye and oats as well as any cross hybrids of these grains (such as triticale). -Family/Genus/Species: Poaceae/Gramineae. - Also known as: Grasses, Grains. - Disclaimer: Refers to the presence of the allergen in the product, as listed in the regulations specified by an agency and specification or any local market regulations.
label: Cereals and its derivatives

AWF
type: Allergen Type Code
Original Code Value: AWF
comment: Refers to the presence of Whitefish and its derivatives in the product. - Family/Genus/Species: (various) - Also known as: Humpback Whitefish, Lake Whitefish, Round Whitefish, Whitefish - Disclaimer: Refers to the presence of the allergen in the product, as listed in the regulations specified by an agency and specification or any local market regulations.
label: Whitefish and its derivatives

AY
type: Allergen Type Code
Original Code Value: AY
comment: Refers to the presence of Soybean and its derivatives in the product, as listed in in the product. - Family/Genus/Species: Glycine max. - Also known as: Soya bean - Disclaimer: Refers to the presence of the allergen in the product, as listed in the regulations specified by an agency and specification or any local market regulations.
label: Soybean and its derivatives

BA
type: Allergen Type Code
Original Code Value: BA
comment: Refers to the presence of Benzyl Alcohol in the product. - CAS Registry Number: 100-51-6 - Also known as: - Disclaimer: Refers to the presence of the allergen in the product, as listed in the regulations specified by an agency and specification or any local market regulations.
label: Benzyl Alcohol

BARLEY
type: Allergen Type Code
Original Code Value: GB
comment: Refers to the presence of Barley and barley products (gluten containing grain) as listed in the regulations specified in AllergenSpecificationAgency and AllergenSpecificationName.
label: Barley and Barley Products
deprecated: GB

BARNACLE
type: Allergen Type Code
Original Code Value: ABF
comment: Refers to the presence of Barnacles and their derivatives in the product, as listed as listed in the regulations specified in AllergenSpecificationAgency and AllergenSpecificationName.
label: Barnacle and its Derivatives
deprecated: ABF

BAS
type: Allergen Type Code
Original Code Value: BAS
comment: Refers to the presence of Basa and its derivates in the product. - Family/Genus/Species: Pangasiidae/Pangasius/P. bocourti - Also known as: Basa, Basa Fish, Bocourti, Pangasius, Panga, Pacific Dory, River Cobbler, Swai - Disclaimer: Refers to the presence of the allergen in the product, as listed in the regulations specified by an agency and specification or any local market regulations.
label: Basa and its derivatives

BASA
type: Allergen Type Code
Original Code Value: BAS
comment: Refers to the presence of Basa and its derivatives in the product, as listed in the regulations specified in AllergenSpecificationAgency and AllergenSpecificationName.
label: Basa and its Derivatives
deprecated: BAS

BASS
type: Allergen Type Code
Original Code Value: ADB
comment: Refers to the presence of bass and their derivatives in the product, as listed as listed in the regulations specified in AllergenSpecificationAgency and AllergenSpecificationName.
label: Bass and its Derivatives
deprecated: ADB

BB
type: Allergen Type Code
Original Code Value: BB
comment: Refers to the presence of Benzyl Benzoate in the product. - CAS Registry Number: 120-51-4 - Also known as: - Disclaimer: Refers to the presence of the allergen in the product, as listed in the regulations specified by an agency and specification or any local market regulations.
label: Benzyl Benzoate

BC
type: Allergen Type Code
Original Code Value: BC
comment: Refers to the presence of celery or its derivatives in the product, as listed in in the product. - Family/Genus/Species: Apium graveolens. - Also known as: - Disclaimer: Refers to the presence of the allergen in the product, as listed in the regulations specified by an agency and specification or any local market regulations.
label: Celery and its derivatives

BE
type: Allergen Type Code
Original Code Value: BE
comment: Refers to the presence of 2 (4-tert-Butylbenzyl) in the product. - CAS Registry Number: 80-54-6 - Also known as: Butylphenyl Methylpropional - Disclaimer: Refers to the presence of the allergen in the product, as listed in the regulations specified by an agency and specification or any local market regulations.
label: 2 (4-tert-Butylbenzyl)

BEECH_NUTS
type: Allergen Type Code
Original Code Value: SD
comment: Refers to the presence of Beech nuts [Fagus spp. (Fagaceae)] and their derivatives in the product, as listed as listed in the regulations specified in AllergenSpecificationAgency and AllergenSpecificationName.
label: Beech Nuts and Their Derivatives
deprecated: SD

BEEF
type: Allergen Type Code
Original Code Value: BF
comment: Refers to the presence of beef and its derivative in the product, as listed in the regulations specified in AllergenSpecificationAgency and AllergenSpecificationName.
label: Beef and its Derivatives
deprecated: BF

BENZYL_ALCOHOL
type: Allergen Type Code
Original Code Value: BA
comment: Refers to the presence of Benzyl Alcohol as listed in the regulations specified in AllergenSpecificationAgency and AllergenSpecificationName.
label: Benzyl Alcohol
deprecated: BA

BENZYL_BENZOATE
type: Allergen Type Code
Original Code Value: BB
comment: Refers to the presence of Benzyl Benzoate as listed in the regulations specified in AllergenSpecificationAgency and AllergenSpecificationName.
label: Benzyl Benzoate
deprecated: BB

BENZYL_CINNAMATE
type: Allergen Type Code
Original Code Value: BI
comment: Refers to the presence of Benzyl Cinnamate as listed in the regulations specified in AllergenSpecificationAgency and AllergenSpecificationName.
label: Benzyl Cinnamate.
deprecated: BI

BENZYL_SALICYLATE
type: Allergen Type Code
Original Code Value: BS
comment: Refers to the presence of Benzyl Salicylate as listed in the regulations specified in AllergenSpecificationAgency and AllergenSpecificationName.
label: Benzyl Salicylate
deprecated: BS

BF
type: Allergen Type Code
Original Code Value: BF
comment: Refers to the presence of beef and its derivative in the product, in the product - Family/Genus/Species: Bos taurus Linnaeus - Also known as: - Disclaimer: Refers to the presence of the allergen in the product, as listed in the regulations specified by an agency and specification or any local market regulations.
label: Beef and its derivatives

BFD
type: Allergen Type Code
Original Code Value: BFD
comment: Refers to the presence of Butterfish and its Derivatives in the product. - Family/Genus/Species: Stromateidae/Pampus or Peprilus or Stromateus/(various) - Also known as: Black Butterfish, Greenbone, Silver Pomfret, White Pomfret, Gulf Butterfish, Harvestfish, Pacific Pompano, Butterfish, Southwest Atlantic ButterfishCommon Name - Disclaimer: Refers to the presence of the allergen in the product, as listed in the regulations specified by an agency and specification or any local market regulations.
label: Butterfish and its derivatives

BFH
type: Allergen Type Code
Original Code Value: BFH
comment: Refers to the presence of Bonito and its Derivatives in the product. - Family/Genus/Species: Scombridae subfamily: Scombrinae/Cybiosarda or Gymnosarda Gill or Orcynopsis Gill or Sarda/(various) - Also known as: Australian Bonito, Dogtooth Tuna, Leaping Bonito, Pacific Bonito, Plain Bonito, Striped Bonito - Disclaimer: Refers to the presence of the allergen in the product, as listed in the regulations specified by an agency and specification or any local market regulations.
label: Bonito fish and its derivatives

BI
type: Allergen Type Code
Original Code Value: BI
comment: Refers to the presence of Benzyl Cinnamate in the product. - CAS Registry Number: 103-41-3 - Also known as: - Disclaimer: Refers to the presence of the allergen in the product, as listed in the regulations specified by an agency and specification or any local market regulations.
label: Benzyl Cinnamate

BLF
type: Allergen Type Code
Original Code Value: BLF
comment: Refers to the presence of Bluefish and its derivates in the product. - Family/Genus/Species: Pomatomidae/Pomatomus/P. saltatrix - Also known as: Bluefish, Elf, Shad, Tailor, Black Sea Bass, Shortfin Corvina, Opaleye, Rudderfish, Pollock - Disclaimer: Refers to the presence of the allergen in the product, as listed in the regulations specified by an agency and specification or any local market regulations.
label: Bluefish and its derivatives

BLUEFISH
type: Allergen Type Code
Original Code Value: BLF
comment: Refers to the presence of Bluefish and its derivatives in the product, as listed in the regulations specified in AllergenSpecificationAgency and AllergenSpecificationName.
label: Bluefish and its Derivatives
deprecated: BLF

BM
type: Allergen Type Code
Original Code Value: BM
comment: Refers to the presence of Mustard or its derivatives in the product, as listed in in the product. - Family/Genus/Species: Brassicaceae. - Also known as: - Disclaimer: Refers to the presence of the allergen in the product, as listed in the regulations specified by an agency and specification or any local market regulations.
label: Mustard and its derivatives

BN
type: Allergen Type Code
Original Code Value: BN
comment: Refers to the presence of Isoeugenol in the product - CAS Registry Number: 97-54-1 - Also known as: - Disclaimer: Refers to the presence of the allergen in the product, as listed in the regulations specified by an agency and specification or any local market regulations.
label: Isoeugenol

BND
type: Allergen Type Code
Original Code Value: BND
comment: Refers to the presence of Banana and its derivatives in the product. - Family/Genus/Species: Musa. - Also known as: - Disclaimer: Refers to the presence of the allergen in the product, as listed in the regulations specified by an agency and specification or any local market regulations.
label: Banana and its derivatives

BO
type: Allergen Type Code
Original Code Value: BO
comment: Refers to the presence of d-Limonene in the product - CAS Registry Number: 5989-27-5 - Also known as: - Disclaimer: Refers to the presence of the allergen in the product, as listed in the regulations specified by an agency and specification or any local market regulations.
label: d-Limonene

BP
type: Allergen Type Code
Original Code Value: BP
comment: Refers to the presence of Linalool in the product - CAS Registry Number: 78-70-6 - Also known as: - Disclaimer: Refers to the presence of the allergen in the product, as listed in the regulations specified by an agency and specification or any local market regulations.
label: Linalool

BQ
type: Allergen Type Code
Original Code Value: BQ
comment: Refers to the presence of Methyl 2-octynoate in the product - CAS Registry Number: 111-12-6 - Also known as: 2-Octynoic acid, methyl ester, Folione, Vert de violette, Methyl 2-octynate, Methyl pentylacetylenecarboxylate, NSC 72098, Methyl Heptin Carbonate, Methyl oct-2-ynoate - Disclaimer: Refers to the presence of the allergen in the product, as listed in the regulations specified by an agency and specification or any local market regulations.
label: Methyl Heptine Carbonate

BR
type: Allergen Type Code
Original Code Value: BR
comment: Refers to the presence of 1,3-Bis-(2,4-diaminophenoxy)propane in the product. - CAS Registry Number: 81892-72-0 - Also known as: - Disclaimer: Refers to the presence of the allergen in the product, as listed in the regulations specified by an agency and specification or any local market regulations.
label: 1,3-Bis-(2,4-diaminophenoxy) propane

BRAZIL_NUTS
type: Allergen Type Code
Original Code Value: SR
comment: Refers to the presence of brazil nut and brazil nut products as listed in the regulations specified in AllergenSpecificationAgency and AllergenSpecificationName.
label: Brazil Nut and Brazil Nut Products
deprecated: SR

BRC
type: Allergen Type Code
Original Code Value: BRC
comment: Refers to the presence of Barracuda and its Derivatives in the product. - Family/Genus/Species: Sphyraenidae/Sphyraena/(various) - Also known as: Pacific Barracuda, California Barracuda, Cuda, Barracouta, Barracuda, Great Barracuda, Short Barracuda, Picuda, Japanese Barracuda, Pickhandle Barracuda - Disclaimer: Refers to the presence of the allergen in the product, as listed in the regulations specified by an agency and specification or any local market regulations.
label: Barracuda and its derivatives

BREAM
type: Allergen Type Code
Original Code Value: BRM
comment: Refers to the presence of Bream and its derivatives in the product, as listed in the regulations specified in AllergenSpecificationAgency and AllergenSpecificationName.
label: Bream and its Derivatives
deprecated: BRM

BRM
type: Allergen Type Code
Original Code Value: BRM
comment: Refers to the presence of Bream and its derivates in the product. - Family/Genus/Species: Cyprinidae sub. Leuciscinae/(various) - Also known as: Antarctic Butterfish, Black Sweetlips, Bloodred Snapper, Bluegill, Blue-lined Large-eye Bream, Bogue, Bream, Bronze Bream, Carp Bream, Common Bream, Common Pandora, Delagoa Threadfin Bream, Fork-tailed Threadfin Bream, Freshwater Bream, Gilthead Bream, Golden Redfish, Golden Tai, Golden Threadfin Bream, Humpnose Big-eye Bream, Japanese Threadfin Bream, Longfin Tilapia, Long-spined Red Bream, Lowfinned Drummer, Madai, Malabar Snapper, Margate, Mauvelip Threadfin Bream, Mozambique Large-eye Bream, Pacific Pomfret, Pinfish, Pumpkinseed, Puntazzo, Red Bream, Red Porgy, Redbreast Tilapia, Redear Sunfish, River Bream, Rock Flagtail, Sea Bream, Southern Rays Bream, Squirefish, Taiwan Tai, Tarakihi, Threadfin Bream, Warmouth, Western Australian Gizzard Shad - Disclaimer: Refers to the presence of the allergen in the product, as listed in the regulations specified by an agency and specification or any local market regulations.
label: Bream and its derivatives

BS
type: Allergen Type Code
Original Code Value: BS
comment: Refers to the presence of Benzyl Salicylate in the product. - CAS Registry Number: 118-58-1 - Also known as: benzyl 2-hydroxybenzoate - Disclaimer: Refers to the presence of the allergen in the product, as listed in the regulations specified by an agency and specification or any local market regulations.
label: Benzyl Salicylate

BUTTERNUTS
type: Allergen Type Code
Original Code Value: SE
comment: Refers to the presence of Butternuts [Juglans cinerea (Juglandaceae)] and their derivatives in the product, as listed as listed in the regulations specified in AllergenSpecificationAgency and AllergenSpecificationName.
label: Butternuts and Their Derivatives
deprecated: SE

BUTYLPHENYL_METHYLPROPIONATE
type: Allergen Type Code
Original Code Value: BE
comment: Refers to the presence of Butylphenyl Methylpropionate as listed in the regulations specified in AllergenSpecificationAgency and AllergenSpecificationName.
label: Butylphenyl Methylpropionate.
deprecated: BE

BWD
type: Allergen Type Code
Original Code Value: BWD
comment: Refers to the presence of buckwheat and its derivatives in the product. - Family/Genus/Species: Fagopyrum. - Also known as: Common buckwheat, Tartary buckwheat, Green buckwheat and Bitter buckwheat. - Disclaimer: Refers to the presence of the allergen in the product, as listed in the regulations specified by an agency and specification or any local market regulations.
label: Buckwheat and its derivatives

CA
type: Allergen Type Code
Original Code Value: CA
comment: Refers to the presence of Cinnamyl Alcohol in the product. - CAS Registry Number: 104-54-1 - Also known as: - Disclaimer: Refers to the presence of the allergen in the product, as listed in the regulations specified by an agency and specification or any local market regulations.
label: Cinnamyl Alcohol

CARP
type: Allergen Type Code
Original Code Value: ACP
comment: Refers to the presence of Carp and their derivatives in the product, as listed as listed in the regulations specified in AllergenSpecificationAgency and AllergenSpecificationName.
label: Carp and its Derivatives
deprecated: ACP

CARROTS
type: Allergen Type Code
Original Code Value: NW
comment: Refers to the presence of carrot and their derivatives in the product, as listed in as listed in the regulations specified in AllergenSpecificationAgency and AllergenSpecificationName
label: Carrot and Derivatives
deprecated: NW

CASHEW_NUTS
type: Allergen Type Code
Original Code Value: SC
comment: Refers to the presence of cashew and cashew products as listed in the regulations specified in AllergenSpecificationAgency and AllergenSpecificationName.
label: Cashew and Cashew Products
deprecated: SC

CATFISH
type: Allergen Type Code
Original Code Value: ADE
comment: Refers to the presence of catfish and their derivatives in the product, as listed as listed in the regulations specified in AllergenSpecificationAgency and AllergenSpecificationName.
label: Catfish and its Derivatives
deprecated: ADE

CELERY
type: Allergen Type Code
Original Code Value: BC
comment: Refers to the presence of celery or their derivatives in the product, as listed in as listed in the regulations specified in AllergenSpecificationAgency and AllergenSpecificationName
label: Celery or Derivatives
deprecated: BC

CEREALS_CONTAINING_GLUTEN
type: Allergen Type Code
Original Code Value: AW
comment: Refers to the presence of Cereals containing gluten and their derivatives in the product, as listed in the regulations specified in AllergenSpecificationAgency and AllergenSpecificationName
label: Cereals Containing Gluten and Their Derivatives
deprecated: AW

CFD
type: Allergen Type Code
Original Code Value: CFD
comment: Refers to the presence of Cutlassfish and its Derivatives in the product. - Family/Genus/Species: Trichiuridae/(various) - Also known as: Black Scabbardfish, Silver Scabbardfish, Smallhead Hairtail, Atlantic Cutlassfish - Disclaimer: Refers to the presence of the allergen in the product, as listed in the regulations specified by an agency and specification or any local market regulations.
label: Cutlassfish and its derivatives

CFH
type: Allergen Type Code
Original Code Value: CFH
comment: Refers to the presence of Croaker and its Derivatives in the product. - Family/Genus/Species: Sciaenidae/(various) - Also known as: Argentine Croaker, Atlantic Croaker, Bearded Jewfish, Belanger's Croaker, Bigtooth Corvina, Black Croaker, Blackmouth Croaker, Blackspotted Croaker, Blue Croaker, Bronze Croaker, Captainfish, Cob, Croceine Croaker, Donkey Croaker, Flathead Captainfish, Giant Captainfish, Gulf Corvina, Japanese Croaker, Meagre, Miiuy Croaker, Pama Croaker, Peruvian Croaker, Redlip Croaker, Reef Croaker, Shortfin Corvina, Shortfin Weakfish, Silver Croaker, Silver Croaker, Smalleye Croaker, Spotfin Croaker, Striped Croaker, Tigertooth Croaker, White Croaker, Whitemouth Drummer, Yellowfin Croaker, Donkey Croaker, Flathead Captainfish, Giant Captainfish, Gulf Corvina, Japanese Croaker, Meagre, Miiuy Croaker, Pama Croaker, Peruvian Croaker, Redlip Croaker, Reef Croaker, Shortfin Corvina, Shortfin Weakfish, Silver Croaker, Silver Croaker, Smalleye Croaker, Spotfin Croaker, Striped Croaker, Tigertooth Croaker, White Croaker, Whitemouth Drummer, Yellowfin Croaker - Disclaimer: Refers to the presence of the allergen in the product, as listed in the regulations specified by an agency and specification or any local market regulations.
label: Croaker fish and its derivatives

CHAR
type: Allergen Type Code
Original Code Value: CHR
comment: Refers to the presence of Char and its derivatives in the product, as listed in the regulations specified in AllergenSpecificationAgency and AllergenSpecificationName.
label: Char and its Derivatives
deprecated: CHR

CHB
type: Allergen Type Code
Original Code Value: CHB
comment: Refers to the presence of Chub and its derivates in the product. - Family/Genus/Species: Cyprinidae or Kyphosidae/(various) - Also known as: Atlantic Chub Mackerel, Bermuda Chub, Bigeye chub, Chum Salmon, Creek Chub, European chub, Fallfish, Flame chub, Flathead chub, Hornyhead chub, Kiyi, Lake chub, Largemouth Bass, Least chub, Leatherside chub, Oregon chub, Pacific Chub Mackerel, Ponto-Caspian chub, Rudderfish, Sea Chub, Slender chub, Spotted Chub Mackerel, Western chub, Yellow Chub - Disclaimer: Refers to the presence of the allergen in the product, as listed in the regulations specified by an agency and specification or any local market regulations.
label: Chub and its derivatives

CHESTNUTS
type: Allergen Type Code
Original Code Value: SN
comment: Refers to the presence of Chestnuts [Castanea spp. (Fagaceae)] and their derivatives in the product, as listed as listed in the regulations specified in AllergenSpecificationAgency and AllergenSpecificationName.
label: Chestnuts and Their Derivatives
deprecated: SN

CHICKEN_MEAT
type: Allergen Type Code
Original Code Value: CM
comment: Refers to the presence of chicken meat and its derivative in the product, as listed in the regulations specified in AllergenSpecificationAgency and AllergenSpecificationName.
label: Chicken Meat and its Derivatives
deprecated: CM

CHINQUAPINS
type: Allergen Type Code
Original Code Value: SF
comment: Refers to the presence of Chinquapins [Castanea pumila (Fagaceae)] and their derivatives in the product, as listed as listed in the regulations specified in AllergenSpecificationAgency and AllergenSpecificationName.
label: Chinquapins and Their Derivatives
deprecated: SF

CHR
type: Allergen Type Code
Original Code Value: CHR
comment: Refers to the presence of Char and its derivates in the product. - Family/Genus/Species: Salmonidae/Salmoninae/Salvelinus - Also known as: Char, Charr, Artic Char, Lake Char, Golden Char, Cole's Char, Coomsaharn Char, Gray's Char, Blunt-snouted Irish Char, Bear Island Char, Alsatian Char, Angayukaksurak Char, Boganida Char, Cherskii's Char, Chukot Char, Dryagin's Char, Kirikuchi Char, Lake Yessey Char, Long-finned Char, Sakhalinian Char, Small-mouth Char, Southern Dolly Varden Char, Taranets Char, White Char, Whitespotted Char, Yakutian Char - Disclaimer: Refers to the presence of the allergen in the product, as listed in the regulations specified by an agency and specification or any local market regulations.
label: Char and its derivatives

CHUB
type: Allergen Type Code
Original Code Value: CHB
comment: Refers to the presence of Chub and its derivatives in the product, as listed in the regulations specified in AllergenSpecificationAgency and AllergenSpecificationName.
label: Chub and its Derivatives
deprecated: CHB

CINNAMAL
type: Allergen Type Code
Original Code Value: CL
comment: Refers to the presence of Cinnamal as listed in the regulations specified in AllergenSpecificationAgency and AllergenSpecificationName.
label: Cinnamal
deprecated: CL

CINNAMYL_ALCOHOL
type: Allergen Type Code
Original Code Value: CA
comment: Refers to the presence of Cinnamyl Alcohol as listed in the regulations specified in AllergenSpecificationAgency and AllergenSpecificationName.
label: Cinnamyl Alcohol
deprecated: CA

CISCO
type: Allergen Type Code
Original Code Value: CSC
comment: Refers to the presence of Cisco and its derivatives in the product, as listed in the regulations specified in AllergenSpecificationAgency and AllergenSpecificationName.
label: Cisco and its Derivatives
deprecated: CSC

CITRAL
type: Allergen Type Code
Original Code Value: CT
comment: Refers to the presence of Citral as listed in the regulations specified in AllergenSpecificationAgency and AllergenSpecificationName.
label: Citral
deprecated: CT

CITRONELLOL
type: Allergen Type Code
Original Code Value: CN
comment: Refers to the presence of Citronellol as listed in the regulations specified in AllergenSpecificationAgency and AllergenSpecificationName.
label: Citronellol
deprecated: CN

CKF
type: Allergen Type Code
Original Code Value: CKF
comment: Refers to the presence of Cusk and its Derivatives in the product. - Family/Genus/Species: Lotidae/Brosme/brosme - Also known as: Cusk, Tusk, Torsk, European Cusk, Brosmius - Disclaimer: Refers to the presence of the allergen in the product, as listed in the regulations specified by an agency and specification or any local market regulations.
label: Cusk fish and its derivatives

CL
type: Allergen Type Code
Original Code Value: CL
comment: Refers to the presence of Cinnamal in the product. - CAS Registry Number: 104-55-2 - Also known as: cinnamaldehyde - Disclaimer: Refers to the presence of the allergen in the product, as listed in the regulations specified by an agency and specification or any local market regulations.
label: Cinnamal

CLAM
type: Allergen Type Code
Original Code Value: CLM
comment: Refers to the presence of Clam and its derivatives in the product, as listed in the regulations specified in AllergenSpecificationAgency and AllergenSpecificationName.
label: Clam and its Derivatives
deprecated: CLM

CLM
type: Allergen Type Code
Original Code Value: CLM
comment: Refers to the presence of Clam and its derivates in the product. - Family/Genus/Species: (various) - Also known as: Alaska Razor, Arctic Surfclam, Asian Clam, Atlantic Geoduck, Atlantic Jackknife, Atlantic Razor, Atlantic Sanguin, Atlantic Surfclam, Banded Carpet Shell, Bent Surfclam, Bentnose Macoma, Butter Clam, Calico Clam, California Surfclam, California Tagelus, California Venus, Caribbean Winged Surfclam, Dish Surfclam, Fat Gaper, Flat Surfclam, Fragile Surfclam, Freshwater Clam, Frilled Venus, Golden Carpet Shell, Grand Razor Shell, Green Jackknife, Grooved Carpet Shell, Grooved Razor, Hard Clam, Hardshell Clam, Hatchet Surfclam, Hemphill Surfclam, Hen Clam, Hooked Surfclam, Jackknife Clam, Japanese Littleneck Clam, Littleneck Clam, Lyrate Hard Clam, Mogai Clam, New Zealand Wedge Clam, Northern Razor, Pacific Gaper, Pacific Geoduck, Pacific Littleneck Clam, Pipi Clam, Pismo Clam, Pod Razor, Razor Shell Clam, Rosy Jackknife, Shortneck Clam, Smooth Venus, Softshell Clam, Solid Sanguin Clam, Stout Tagelus, Sunray Venus, Sword Razor, Thin-shell Littleneck Clam, Washington Clam - Disclaimer: Refers to the presence of the allergen in the product, as listed in the regulations specified by an agency and specification or any local market regulations.
label: Clam and its derivatives

CM
type: Allergen Type Code
Original Code Value: CM
comment: Refers to the presence of chicken meat and its derivative in the product, in the product - Family/Genus/Species: Gallus domesticus - Also known as: - Disclaimer: Refers to the presence of the allergen in the product, as listed in the regulations specified by an agency and specification or any local market regulations.
label: Chicken Meat and its derivatives

CN
type: Allergen Type Code
Original Code Value: CN
comment: Refers to the presence of Citronellol in the product. - Family/Genus/Species: - Also known as: - Disclaimer: Refers to the presence of the allergen in the product, as listed in the regulations specified by an agency and specification or any local market regulations.
label: Citronellol

CO
type: Allergen Type Code
Original Code Value: CO
comment: Refers to the presence of Coumarin in the product. - Family/Genus/Species: - Also known as: - Disclaimer: Refers to the presence of the allergen in the product, as listed in the regulations specified by an agency and specification or any local market regulations.
label: Coumarin

COCKLE
type: Allergen Type Code
Original Code Value: COK
comment: Refers to the presence of Cockle and its derivatives in the product, as listed in the regulations specified in AllergenSpecificationAgency and AllergenSpecificationName.
label: Cockle and its Derivatives
deprecated: COK

COCOA
type: Allergen Type Code
Original Code Value: NC
comment: Refers to the presence of cocoa and their derivatives in the product, as listed in as listed in the regulations specified in AllergenSpecificationAgency and AllergenSpecificationName
label: Cocoa and Derivatives
deprecated: NC

COCONUTS
type: Allergen Type Code
Original Code Value: SO
comment: Refers to the presence of Coconuts [Cocos (Arecaceae)] and their derivatives in the product, as listed as listed in the regulations specified in AllergenSpecificationAgency and AllergenSpecificationName.
label: Coconuts and Their Derivatives
deprecated: SO

COD
type: Allergen Type Code
Original Code Value: ADF
comment: Refers to the presence of Cod and their derivatives in the product, as listed as listed in the regulations specified in AllergenSpecificationAgency and AllergenSpecificationName.
label: Cod and its Derivatives
deprecated: ADF

COK
type: Allergen Type Code
Original Code Value: COK
comment: Refers to the presence of Cockle and its derivates in the product. - Family/Genus/Species: Cardiidae/(various) - Also known as: Atlantic Giant Cockle, Bittersweet, Blood Cockle, California Cockle, Common Cockle, Decussate Bittersweet, Dock Cockle, Greenland Cockle, Knotted Cockle, New Zealand Cockle, Spiny Cockle, Violet Bittersweet - Disclaimer: Refers to the presence of the allergen in the product, as listed in the regulations specified by an agency and specification or any local market regulations.
label: Cockle and its derivatives

CON
type: Allergen Type Code
Original Code Value: CON
comment: Refers to the presence of Conch and its derivates in the product. - Family/Genus/Species: Strombidae/(various) - Also known as: Conch, Florida Fighting Conch, Horse Conch, Milk Conch, Queen Conch, Spider Conch, West Indian Fighting Conch - Disclaimer: Refers to the presence of the allergen in the product, as listed in the regulations specified by an agency and specification or any local market regulations.
label: Conch and its derivatives

CONCH
type: Allergen Type Code
Original Code Value: CON
comment: Refers to the presence of Conch and its derivatives in the product, as listed in the regulations specified in AllergenSpecificationAgency and AllergenSpecificationName.
label: Conch and its Derivatives
deprecated: CON

CORIANDER
type: Allergen Type Code
Original Code Value: NK
comment: Refers to the presence of coriander and their derivatives in the product, as listed in as listed in the regulations specified in AllergenSpecificationAgency and AllergenSpecificationName
label: Coriander Derivatives
deprecated: NK

CORN
type: Allergen Type Code
Original Code Value: NM
comment: Refers to the presence of corn and their derivatives in the product, as listed in as listed in the regulations specified in AllergenSpecificationAgency and AllergenSpecificationName
label: Corn and Derivatives
deprecated: NM

COTTON_SEEDS
type: Allergen Type Code
Original Code Value: CS
comment: Refers to the presence of Cotton Seeds or their derivatives in the product as listed in the regulations specified in AllergenSpecificationAgency and AllergenSpecificationName
label: Cotton Seeds and Their Derivatives
deprecated: CS

COUMARIN
type: Allergen Type Code
Original Code Value: CO
comment: Refers to the presence of Coumarin as listed in the regulations specified in AllergenSpecificationAgency and AllergenSpecificationName.
label: Coumarin
deprecated: CO

CRAB
type: Allergen Type Code
Original Code Value: ABG
comment: Refers to the presence of Crab and their derivatives in the product, as listed as listed in the regulations specified in AllergenSpecificationAgency and AllergenSpecificationName.
label: Crab and its Derivatives
deprecated: ABG

CRAWFISH
type: Allergen Type Code
Original Code Value: ABH
comment: Refers to the presence of Crawfish and their derivatives in the product, as listed as listed in the regulations specified in AllergenSpecificationAgency and AllergenSpecificationName.
label: Crawfish and its Derivatives
deprecated: ABH

CRUSTACEANS
type: Allergen Type Code
Original Code Value: AC
comment: Refers to the presence of Crustaceans and their derivatives in the product, as listed as listed in the regulations specified in AllergenSpecificationAgency and AllergenSpecificationName
label: Crustaceans and Their Derivatives
deprecated: AC

CS
type: Allergen Type Code
Original Code Value: CS
comment: Refers to the presence of Cotton Seeds or its derivatives in the product in the product - Family/Genus/Species: Gossypium. - Also known as: - Disclaimer: Refers to the presence of the allergen in the product, as listed in the regulations specified by an agency and specification or any local market regulations.
label: Cotton Seeds and its derivatives

CSC
type: Allergen Type Code
Original Code Value: CSC
comment: Refers to the presence of Cisco and its derivates in the product. - Family/Genus/Species: Salmonidae/Coregonus/(various) - Also known as: Arctic Cisco, Bering Cisco, Blackfin Cisco, Bloater, Cisco, Deepwater Cisco, European Cisco, Irish pollan, Kiyi, Lake Cisco, Lake Herring, Least Cisco, Longjaw Cisco, Northern Cisco, Peled, Sardine Cisco, Shortjaw Cisco, Shortnose Cisco, Stechlin Cisco - Disclaimer: Refers to the presence of the allergen in the product, as listed in the regulations specified by an agency and specification or any local market regulations.
label: Cisco and its derivatives

CT
type: Allergen Type Code
Original Code Value: CT
comment: Refers to the presence of Citral in the product. - CAS Registry Number: 5392-40-5 - Also known as: - Disclaimer: Refers to the presence of the allergen in the product, as listed in the regulations specified by an agency and specification or any local market regulations.
label: Citral

D-LIMONENE
type: Allergen Type Code
Original Code Value: BO
comment: Refers to the presence of d-Limonene as listed in the regulations specified in AllergenSpecificationAgency and AllergenSpecificationName
label: d-Limonene
deprecated: BO

DA
type: Allergen Type Code
Original Code Value: DA
comment: Refers to the presence of 2,6-Dimethoxy-3,5-pyridine diamine HCl in the product. - CAS Registry Number: 56216-28-5 - Also known as: - Disclaimer: Refers to the presence of the allergen in the product, as listed in the regulations specified by an agency and specification or any local market regulations.
label: 2,6-Dimethoxy-3,5-pyridinediamine HCl

DIAMINOPHENOLS
type: Allergen Type Code
Original Code Value: DP
comment: Refers to the presence of Diaminophenols as listed in the regulations specified in AllergenSpecificationAgency and AllergenSpecificationName.
label: Diaminophenols
deprecated: DP

DMF
type: Allergen Type Code
Original Code Value: DMF
comment: Refers to the presence of Drum and its Derivatives in the product. - Family/Genus/Species: Sciaenidae/(various) - Also known as: Banded Drum, Black Drum, Corb, Cubbyu, Freshwater Drum, Queenfish, Red Drum, Sand Drum, Spotted Drum, Star Drum, Totoaba - Disclaimer: Refers to the presence of the allergen in the product, as listed in the regulations specified by an agency and specification or any local market regulations.
label: Drum fish and its derivatives

DP
type: Allergen Type Code
Original Code Value: DP
comment: Refers to the presence of Diaminophenol in the product. - CAS Registry Number: - Also known as: 137-09-7 - Disclaimer: Refers to the presence of the allergen in the product, as listed in the regulations specified by an agency and specification or any local market regulations.
label: Diaminophenols

DYF
type: Allergen Type Code
Original Code Value: DYF
comment: Refers to the presence of Dory and its Derivatives in the product. - Family/Genus/Species: (various) - Also known as: Black Oreo Dory, Buckler Dory, John Dory, Mirror Dory, Oreo, Silver Dory, Smooth Oreo Dory - Disclaimer: Refers to the presence of the allergen in the product, as listed in the regulations specified by an agency and specification or any local market regulations.
label: Dory fish and its derivatives

EEL
type: Allergen Type Code
Original Code Value: EEL
comment: Refers to the presence of Eel and its derivates in the product. - Family/Genus/Species: (various) - Also known as: American Eel, Bandtooth Conger, Blackedge Cusk-eel, Blacktail Moray, Blacktail Pike-conger, Broadbanded Moray, Brown Moray, Conger Eel, Daggertooth Pike Conger, European Eel, Fangtooth Moray, Fawn Cusk-eel, Freckled Pike-conger, Giant Moray, Giant Snake Eel, Goldentail Moray, Green Moray, Hardtail Conger, Honey Comb Moray, Japanese Eel, Lesser Spiny Eel, Longfin Conger, Long-finned Eel, Manytooth Conger, Margintail Conger, Mottled Cusk-eel, Murray, Pebbletooth Moray, Reticulate Moray, Sea Eel, Short-finned Eel, Spiny Eel, Spotjaw Moray, Spotted Pike-conger, Stout Moray, Tiretrack Eel, Whiptail Conger, White Eel, Yellow Conger - Disclaimer: Refers to the presence of the allergen in the product, as listed in the regulations specified by an agency and specification or any local market regulations.
label: Eel and its derivatives
comment: Refers to the presence of Eel and its derivatives in the product, as listed in the regulations specified in AllergenSpecificationAgency and AllergenSpecificationName.
label: Eel and its Derivatives

EG
type: Allergen Type Code
Original Code Value: EG
comment: Refers to the presence of Eugenol in the product. - CAS Registry Number: 97-53-0 - Also known as: clove oil - Disclaimer: Refers to the presence of the allergen in the product, as listed in the regulations specified by an agency and specification or any local market regulations.
label: Eugenol

EGGS
type: Allergen Type Code
Original Code Value: AE
comment: Refers to the presence of eggs and their derivatives in the product, as listed as listed in the regulations specified in AllergenSpecificationAgency and AllergenSpecificationName
label: Eggs and Their Derivatives
deprecated: AE

EOD
type: Allergen Type Code
Original Code Value: EOD
comment: Refers to the presence of Escolar and its Derivatives in the product. - Family/Genus/Species: Gempylidae/Lepidocybium/flavobrunneum - Also known as: Escolar - Disclaimer: Refers to the presence of the allergen in the product, as listed in the regulations specified by an agency and specification or any local market regulations.
label: Escolar and its derivatives

EP
type: Allergen Type Code
Original Code Value: EP
comment: Refers to the presence of Oakmoss extract in the product. - Family/Genus/Species: Evernia prunastri. - CAS Registry Number: 90028-68-5 - Also known as: - Disclaimer: Refers to the presence of the allergen in the product, as listed in the regulations specified by an agency and specification or any local market regulations.
label: Oak Moss Extract and its derivatives

EUGENOL
type: Allergen Type Code
Original Code Value: EG
comment: Refers to the presence of Eugenol as listed in the regulations specified in AllergenSpecificationAgency and AllergenSpecificationName.
label: Eugenol
deprecated: EG

EV
type: Allergen Type Code
Original Code Value: EV
comment: Refers to the presence of Treemoss extract in the product - Family/Genus/Species: Evernia Furfuracea - CAS Registry Number: 90028-67-4 - Also known as: - Disclaimer: Refers to the presence of the allergen in the product, as listed in the regulations specified by an agency and specification or any local market regulations.
label: Treemoss Extract and its derivatives

EVERNIA_FURFURACEA
type: Allergen Type Code
Original Code Value: EV
comment: Refers to the presence of Evernia Furfuracea as listed in the regulations specified in AllergenSpecificationAgency and AllergenSpecificationName.
label: Evernia Furfuracea
deprecated: EV

EVERNIA_PRUNASTRI
type: Allergen Type Code
Original Code Value: EP
comment: Refers to the presence of Evernia Prunastri as listed in the regulations specified in AllergenSpecificationAgency and AllergenSpecificationName.
label: Evernia Prunastri
deprecated: EP

FA
type: Allergen Type Code
Original Code Value: FA
comment: Refers to the presence of Farnesol in the product. - CAS Registry Number: 4602-84-0 - Also known as: - Disclaimer: Refers to the presence of the allergen in the product, as listed in the regulations specified by an agency and specification or any local market regulations.
label: Farnesol

FARNESOL
type: Allergen Type Code
Original Code Value: FA
comment: Refers to the presence of Farnesol as listed in the regulations specified in AllergenSpecificationAgency and AllergenSpecificationName.
label: Farnesol
deprecated: FA

FH
type: Allergen Type Code
Original Code Value: FH
comment: Refers to the presence of 4-Hydroxy-propyl amino-3-nitrophenol in the product. - CAS Registry Number: 92952-81-3 - Also known as: - Disclaimer: Refers to the presence of the allergen in the product, as listed in the regulations specified by an agency and specification or any local market regulations.
label: 4-Hydroxy-propylamino-3-nitrophenol

FISH
type: Allergen Type Code
Original Code Value: AF
comment: Refers to the presence of Fish and their derivatives in the product, as listed in as listed in the regulations specified in AllergenSpecificationAgency and AllergenSpecificationName
label: Fish and Their Derivatives
deprecated: AF

FLOUNDER
type: Allergen Type Code
Original Code Value: ADG
comment: Refers to the presence of Flounder and their derivatives in the product, as listed as listed in the regulations specified in AllergenSpecificationAgency and AllergenSpecificationName.
label: Flounder and its Derivatives
deprecated: ADG

FT
type: Allergen Type Code
Original Code Value: FT
comment: Refers to the presence of 4-Amino-3-nitrophenol in the product. - CAS Registry Number: 610-81-1 - Also known as: - Disclaimer: Refers to the presence of the allergen in the product, as listed in the regulations specified by an agency and specification or any local market regulations.
label: 4-Amino-3-nitrophenol

GB
type: Allergen Type Code
Original Code Value: GB
comment: Refers to the presence of barley and its derivatives in the product. - Family/Genus/Species: Hordeum vulgare. - Also known as: - Disclaimer: Refers to the presence of the allergen in the product, as listed in the regulations specified by an agency and specification or any local market regulations.
label: Barley and its derivatives

GE
type: Allergen Type Code
Original Code Value: GE
comment: Refers to the presence of Geraniol in the product. - CAS Registry Number: 106-24-1 - Also known as: - Disclaimer: Refers to the presence of the allergen in the product, as listed in the regulations specified by an agency and specification or any local market regulations.
label: Geraniol

GERANIOL
type: Allergen Type Code
Original Code Value: GE
comment: Refers to the presence of Geraniol as listed in the regulations specified in AllergenSpecificationAgency and AllergenSpecificationName.
label: Geraniol
deprecated: GE

GINKGO_NUTS
type: Allergen Type Code
Original Code Value: SG
comment: Refers to the presence of Ginkgo nuts [Ginkgo biloba L. (Ginkgoaceae)] and their derivatives in the product, as listed as listed in the regulations specified in AllergenSpecificationAgency and AllergenSpecificationName.
label: Ginkgo Nuts and Their Derivatives
deprecated: SG

GK
type: Allergen Type Code
Original Code Value: GK
comment: Refers to the presence of kamut and its derivatives in the product. - Family/Genus/Species: Triticum turanicum. - Also known as: Khorasan wheat, Oriental wheat. - Disclaimer: Refers to the presence of the allergen in the product, as listed in the regulations specified by an agency and specification or any local market regulations.
label: Kamut and its derivatives

GL
type: Allergen Type Code
Original Code Value: GL
comment: Refers to the presence of Glutamate and its derivatives in the product. - Family/Genus/Species: - Also known as: Glutamic acid. - Disclaimer: Refers to the presence of the allergen in the product, as listed in the regulations specified by an agency and specification or any local market regulations.
label: Glutamate and its derivatives

GLUTAMATE
type: Allergen Type Code
Original Code Value: GL
comment: Refers to the presence of glutamate and its derivative in the product, as listed in the regulations specified in AllergenSpecificationAgency and AllergenSpecificationName.
label: Glutamate and Their Derivatives
deprecated: GL

GLUTEN
type: Allergen Type Code
Original Code Value: AX
comment: Refers to the presense of other gluten containing grain and gluten containing grain products as listed in the regulations specified in AllergenSpecificationAgency and AllergenSpecificationName.
label: Gluten
deprecated: AW

GO
type: Allergen Type Code
Original Code Value: GO
comment: Refers to the presence of Oat and its derivatives in the product. - Family/Genus/Species: Avena sativa. - Also known as: Common oat. - Disclaimer: Refers to the presence of the allergen in the product, as listed in the regulations specified by an agency and specification or any local market regulations.
label: Oats and its derivatives

GOM
type: Allergen Type Code
Original Code Value: GOM
comment: Refers to the presence of Goat milk and its derivatives in the product, as listed in in the product. - Family/Genus/Species: Capra - Also known as: - Disclaimer: Refers to the presence of the allergen in the product, as listed in the regulations specified by an agency and specification or any local market regulations.
label: Goat Milk

GROUPER
type: Allergen Type Code
Original Code Value: ADH
comment: Refers to the presence of Grouper and their derivatives in the product, as listed as listed in the regulations specified in AllergenSpecificationAgency and AllergenSpecificationName.
label: Grouper and its Derivatives
deprecated: ADH

GS
type: Allergen Type Code
Original Code Value: GS
comment: Refers to the presence of Spelt and its derivatives in the product. - Family/Genus/Species: Pooideae/Triticum/T. spelta - Also known as: Spelt, Dinkel Wheat, Hulled Wheat - Disclaimer: Refers to the presence of the allergen in the product, as listed in the regulations specified by an agency and specification or any local market regulations.
label: Spelt and its derivatives

GTD
type: Allergen Type Code
Original Code Value: GTD
comment: Refers to the presence of Gelatine in the product. - CAS Registry Number: 9000-70-8 - Also known as: Gelatin - Disclaimer: Refers to the presence of the allergen in the product, as listed in the regulations specified by an agency and specification or any local market regulations.
label: Gelatine and its derivatives

HADDOCK
type: Allergen Type Code
Original Code Value: ADI
comment: Refers to the presence of Haddock and their derivatives in the product, as listed as listed in the regulations specified in AllergenSpecificationAgency and AllergenSpecificationName.
label: Haddock and its Derivatives
deprecated: ADI

HAKE
type: Allergen Type Code
Original Code Value: ADJ
comment: Refers to the presence of Hake and their derivatives in the product, as listed as listed in the regulations specified in AllergenSpecificationAgency and AllergenSpecificationName.
label: Hake and its Derivatives
deprecated: ADJ

HALIBUT
type: Allergen Type Code
Original Code Value: ADK
comment: Refers to the presence of Halibut and their derivatives in the product, as listed as listed in the regulations specified in AllergenSpecificationAgency and AllergenSpecificationName.
label: Halibut and its Derivatives
deprecated: ADK

HAZELNUTS
type: Allergen Type Code
Original Code Value: SH
comment: Refers to the presence of hazelnut and hazelnut products as listed in the regulations specified in AllergenSpecificationAgency and AllergenSpecificationName.
label: Hazelnut and Hazelnut Products
deprecated: SH

HB
type: Allergen Type Code
Original Code Value: HB
comment: Refers to the presence of HC Blue No 12 in the product. - CAS Registry Number: 132885-85-9 - Also known as: 1-(alpha-hydroxyethyl)amino-2-nitro-4,N-ethyl-N-(alpha-hydroxyethyl)aminobenzene - Disclaimer: Refers to the presence of the allergen in the product, as listed in the regulations specified by an agency and specification or any local market regulations.
label: HC Blue No 12

HC
type: Allergen Type Code
Original Code Value: HC
comment: Refers to the presence of Hydroxyisohexyl 3-Cyclohexene Carboxaldehyde in the product. - CAS Registry Number: 31906-04-4 - Also known as: Hydroxy-methylpentylcyclohexenecarboxaldehyde - Disclaimer: Refers to the presence of the allergen in the product, as listed in the regulations specified by an agency and specification or any local market regulations.
label: Hydroxyisohexyl 3-Cyclohexene Carboxaldehyde

HC_BLUE_NO_11
type: Allergen Type Code
Original Code Value: HD
comment: Refers to the presence of HC Blue No 11 as listed in the regulations specified in AllergenSpecificationAgency and AllergenSpecificationName.
label: HC Blue No 11
deprecated: HD

HC_BLUE_NO_12
type: Allergen Type Code
Original Code Value: HB
comment: Refers to the presence of HC Blue No 12 as listed in the regulations specified in AllergenSpecificationAgency and AllergenSpecificationName.
label: HC Blue No 12
deprecated: HB

HD
type: Allergen Type Code
Original Code Value: HD
comment: Refers to the presence of HC Blue No 11 in the product. - CAS Registry Number: 23920-15-2 - Also known as: 2,2'-((4-((2-methoxyethyl)amino)-3-nitrophenyl)imino)diethanol - Disclaimer: Refers to the presence of the allergen in the product, as listed in the regulations specified by an agency and specification or any local market regulations.
label: HC Blue No 11

HE
type: Allergen Type Code
Original Code Value: HE
comment: Refers to the presence of Hydroxybenzomorpholine in the product. - CAS Registry Number: 26021-57-8 - Also known as: 6-Hydroxybenzomorpholine - Disclaimer: Refers to the presence of the allergen in the product, as listed in the regulations specified by an agency and specification or any local market regulations.
label: Hydroxybenzomorpholine

HERRING
type: Allergen Type Code
Original Code Value: ADL
comment: Refers to the presence of Herring and their derivatives in the product, as listed as listed in the regulations specified in AllergenSpecificationAgency and AllergenSpecificationName.
label: Herring and its Derivatives
deprecated: ADL

HEXYL_CINNAMAL
type: Allergen Type Code
Original Code Value: HX
comment: Refers to the presence of Hexyl Cinnamal as listed in the regulations specified in AllergenSpecificationAgency and AllergenSpecificationName.
label: Hexyl Cinnamal
deprecated: HX

HH
type: Allergen Type Code
Original Code Value: HH
comment: Refers to the presence of Hydroxypropyl bis(N-hydroxyethyl-p-phenylenediamine) HCl in the product. - CAS Registry Number: 128729-28-2 - Also known as: - Disclaimer: Refers to the presence of the allergen in the product, as listed in the regulations specified by an agency and specification or any local market regulations.
label: Hydroxypropyl bis(N-hydroxyethyl-p-phenyldiamine) HCl

HICKORY_NUTS
type: Allergen Type Code
Original Code Value: SI
comment: Refers to the presence of hickory nuts [Carya spp. (Junglandacease)] and their derivatives in the product, as listed as listed in the regulations specified in AllergenSpecificationAgency and AllergenSpecificationName.
label: Hickory Nuts and Their Derivatives
deprecated: SI

HN
type: Allergen Type Code
Original Code Value: HN
comment: Refers to the presence of Hydroxyethyl-2-nitro-p-toluidine in the product. - CAS Registry Number: 100418-33-5 - Also known as: - Disclaimer: Refers to the presence of the allergen in the product, as listed in the regulations specified by an agency and specification or any local market regulations.
label: Hydroxyethyl-2-nitro-p-toluidine

HP
type: Allergen Type Code
Original Code Value: HP
comment: Refers to the presence of 2-Hydroxyethyl-picramic acid in the product. - CAS Registry Number: 99610-72-7 - Also known as: - Disclaimer: Refers to the presence of the allergen in the product, as listed in the regulations specified by an agency and specification or any local market regulations.
label: 2-Hydroxyethyl-picramic Acid

HX
type: Allergen Type Code
Original Code Value: HX
comment: Refers to the presence of Hexyl Cinnamaldehyde in the product. - CAS Registry Number: 101-86-0 - Also known as: hexyl cinnamal - Disclaimer: Refers to the presence of the allergen in the product, as listed in the regulations specified by an agency and specification or any local market regulations.
label: Hexyl Cinnamaldehyde

HY
type: Allergen Type Code
Original Code Value: HY
comment: Refers to the presence of Hydroxycitronellal in the product. - CAS Registry Number: 107-75-5 - Also known as: - Disclaimer: Refers to the presence of the allergen in the product, as listed in the regulations specified by an agency and specification or any local market regulations.
label: Hydroxycitronellal

HYDROXYBENZOMORPHOLINE
type: Allergen Type Code
Original Code Value: HE
comment: Refers to the presence of Hydroxybenzomorpholine as listed in the regulations specified in AllergenSpecificationAgency and AllergenSpecificationName.
label: Hydroxybenzomorpholine
deprecated: HE

HYDROXYCITRONELLAL
type: Allergen Type Code
Original Code Value: HY
comment: Refers to the presence of Hydroxycitronellal as listed in the regulations specified in AllergenSpecificationAgency and AllergenSpecificationName.
label: Hydroxycitronellal
deprecated: HY

HYDROXYETHYL-2-NITRO-P-TOLUIDINE
type: Allergen Type Code
Original Code Value: HN
comment: Refers to the presence of Hydroxyethyl-2-nitro-p-toluidine as listed in the regulations specified in AllergenSpecificationAgency and AllergenSpecificationName.
label: Hydroxyethyl-2-nitro-p-toluidine
deprecated: HN

HYDROXYISOHEXYL_3-CYCLOHEXENE_CARBOXALDEHYDE_ISOEUGENOL_LIMONENE_LINAL
type: Allergen Type Code
Original Code Value: HC
comment: Refers to the presence of Hydroxyisohexyl 3-Cyclohexene Carboxaldehyde Isoeugenol Limonene Linal as listed in the regulations specified in AllergenSpecificationAgency and llergenSpecificationName.
label: Hydroxyisohexyl 3-Cyclohexene Carboxaldehyde Isoeugenol Limonene Linal
deprecated: HC

HYDROXYPROPYL_BIS(N-HYDROXYETHYL-P-PHENYLDIAMINE)_HCL
type: Allergen Type Code
Original Code Value: HH
comment: Refers to the presence of Hydroxypropyl bis(N-hydroxyethyl-p-phenyldiamine) HCl as listed in the regulations specified in AllergenSpecificationAgency and AllergenSpecificationName.
label: Hydroxypropyl bis(N-hydroxyethyl-p-phenyldiamine) HCl
deprecated: HH

ISOEUGENOL
type: Allergen Type Code
Original Code Value: BN
comment: Refers to the presence of Isoeugenol as listed in the regulations specified in AllergenSpecificationAgency and AllergenSpecificationName
label: Isoeugenol
deprecated: BN

JCH
type: Allergen Type Code
Original Code Value: JCH
comment: Refers to the presence of Japanese horse chestnuts and its derivatives in the product. - Family/Genus/Species: Aesculus turbinata. - Also known as: - Disclaimer: Refers to the presence of the allergen in the product, as listed in the regulations specified by an agency and specification or any local market regulations.
label: Japanese horse chestnut and its derivatives

JFD
type: Allergen Type Code
Original Code Value: JFD
comment: Refers to the presence of Jack and its Derivatives in the product. - Family/Genus/Species: (various) - Also known as: (Mix of fish in the 'jack' families) - Disclaimer: Refers to the presence of the allergen in the product, as listed in the regulations specified by an agency and specification or any local market regulations.
label: Jack fish and its derivatives

KAMUT
type: Allergen Type Code
Original Code Value: GK
comment: Refers to the presence of kamut and kamut products (glutencontaining grain) as listed in the regulations specified in AllergenSpecificationAgency and AllergenSpecificationName.
label: Kamut and Kamut Products
deprecated: GK

KRILL
type: Allergen Type Code
Original Code Value: ABI
comment: Refers to the presence of Krill and their derivatives in the product, as listed as listed in the regulations specified in AllergenSpecificationAgency and AllergenSpecificationName.
label: Krill and its Derivatives
deprecated: ABI

KWD
type: Allergen Type Code
Original Code Value: KWD
comment: Refers to the presence of Kiwi and its derivatives in the product. - Family/Genus/Species: Actinidia. - Also known as: Chinese Gooseberry. - Disclaimer: Refers to the presence of the allergen in the product, as listed in the regulations specified by an agency and specification or any local market regulations.
label: Kiwi and its derivatives

LACTOSE
type: Allergen Type Code
Original Code Value: ML
comment: Refers to the presence of lactose as listed in the regulations specified in AllergenSpecificationAgency and AllergenSpecificationName.
label: Lactose
deprecated: ML

LAND
type: Allergen Type Code
Original Code Value: LSN
comment: Refers to the presence of Land and sea snails (Escargot) and its derivatives in the product, as listed in the regulations specified in AllergenSpecificationAgency and AllergenSpecificationName.
label: Land and sea snails (Escargot) and its Derivatives
deprecated: LSN

LGD
type: Allergen Type Code
Original Code Value: LGD
comment: Refers to the presence of Lingcod and its Derivatives in the product. - Family/Genus/Species: Hexagrammidae/Ophiodon/elongatus - Also known as: Lingcod, Ling Cod, Buffalo cod, Cultus cod - Disclaimer: Refers to the presence of the allergen in the product, as listed in the regulations specified by an agency and specification or any local market regulations.
label: Lingcod and its derivatives

LICHEE_NUTS
type: Allergen Type Code
Original Code Value: SL
comment: Refers to the presence of Lichee nuts [Litchi chinensis Sonn. (Sapindaceae)] and their derivatives in the product, as listed as listed in the regulations specified in AllergenSpecificationAgency and AllergenSpecificationName.
label: Lichee Nuts and Their Derivatives
deprecated: SL

LIMPETS
type: Allergen Type Code
Original Code Value: LMT
comment: Refers to the presence of Limpets and its derivatives in the product, as listed in the regulations specified in AllergenSpecificationAgency and AllergenSpecificationName.
label: Limpets and its Derivatives
deprecated: LMT

LINALOOL
type: Allergen Type Code
Original Code Value: BP
comment: Refers to the presence of Linalool as listed in the regulations specified in AllergenSpecificationAgency and AllergenSpecificationName
label: Linalool
deprecated: BP

LMT
type: Allergen Type Code
Original Code Value: LMT
comment: Refers to the presence of Limpets and its derivates in the product. - Family/Genus/Species: Patellogastropoda (various) - Also known as: Hoof Snail, Keyhole Limpet, Keyhole Limpte, Lake Limpet, Limpet, Limpets, Owl Limpet, Plant Limpet, Purple Keyhole Limpet, Rayed Mediterranean Limpet, Rough Keyhole Limpet, Rver Limpet, Slipper Snail, Slit Limpet, Umbrella Slugs - Disclaimer: Refers to the presence of the allergen in the product, as listed in the regulations specified by an agency and specification or any local market regulations.
label: Limpets and its derivatives

LOBSTER
type: Allergen Type Code
Original Code Value: ABJ
comment: Refers to the presence of Lobster and their derivatives in the product, as listed as listed in the regulations specified in AllergenSpecificationAgency and AllergenSpecificationName.
label: Lobster and its Derivatives
deprecated: ABJ

LSN
type: Allergen Type Code
Original Code Value: LSN
comment: Refers to the presence of Land and sea snails (Escargot) and its derivates in the product. - Family/Genus/Species: Gastropoda (various) - Also known as: (various) - Disclaimer: Refers to the presence of the allergen in the product, as listed in the regulations specified by an agency and specification or any local market regulations.
label: Land and sea snails (Escargot) and its derivatives

LUPINE
type: Allergen Type Code
Original Code Value: NL
comment: Refers to the presence of Lupine and their derivatives in the product, as listed in as listed in the regulations specified in AllergenSpecificationAgency and AllergenSpecificationName
label: Lupine and Derivatives
deprecated: NL

LX
type: Allergen Type Code
Original Code Value: LX
comment: Refers to the presence of latex in the product. - CAS Registry Number: 9006-04-6 - Also known as: - Disclaimer: Refers to the presence of the allergen in the product, as listed in the regulations specified by an agency and specification or any local market regulations.
label: Latex

MAC
type: Allergen Type Code
Original Code Value: MAC
comment: Refers to the presence of Mackerel and its derivates in the product. - Family/Genus/Species: Acanthocybium or Grammatorcynus or Rastrelliger or Scombridae or Scomberomorus/(various) - Also known as: Atka Mackerel, Atlantic Mackerel, Atlantic Sierra, Atlantic Spanish Mackerel, Australian Spotted Mackerel, Blue Mackerel, Broadbarred King Mackerel, Butterfly Mackerel, Cero, Cero Mackerel, Chinese Mackerel, Double-lined Mackerel, Gulf Sierra, Indian Mackerel, Indo-Pacific king Mackerel, Island Mackerel, Japanese Seer, Japanese Spanish Mackerel, King Mackerel, Korean Mackerel, Monterey Spanish Mackerel, Narrow-barred Mackerel, Narrow-barred Spanish Mackerel, Pacific Sierra, Papuan Spanish Mackerel, Queen Mackerel, Queensland School Mackerel, Serra Spanish Mackerel, Shark Mackerel, Short Mackerel, Spanish Mackerel, Spotted Seerfish - Disclaimer: Refers to the presence of the allergen in the product, as listed in the regulations specified by an agency and specification or any local market regulations.
label: Mackerel and its derivatives

MACADAMIA_NUTS
type: Allergen Type Code
Original Code Value: SM
comment: Refers to the presence of macadamia nut and macadamia nut products as listed in the regulations specified in AllergenSpecificationAgency and AllergenSpecificationName
label: Macadamia Nut and Macadamia Nut Products
deprecated: SM

MACKEREL
type: Allergen Type Code
Original Code Value: MAC
comment: Refers to the presence of Mackerel and its derivatives in the product, as listed in the regulations specified in AllergenSpecificationAgency and AllergenSpecificationName.
label: Mackerel and its Derivatives
deprecated: MAC

MAHI_MAHI
type: Allergen Type Code
Original Code Value: ADM
comment: Refers to the presence of Mahi Mahi and their derivatives in the product, as listed as listed in the regulations specified in AllergenSpecificationAgency and AllergenSpecificationName.
label: Mahi mahi and its Derivatives
deprecated: ADM

MAL
type: Allergen Type Code
Original Code Value: MAL
comment: Refers to the presence of Marlin and its derivates in the product. - Family/Genus/Species: Istiophoridae/(various) - Also known as: Atlantic Blue Marlin, Atlantic Sailfish, Black Marlin, Indo-Pacific Blue Marlin, Indo-Pacific Sailfish, Longbill Spearfish, Mediterranean Spearfish, Roundscale Spearfish, Shortbill Spearfish, Striped Marlin, White Marlin - Disclaimer: Refers to the presence of the allergen in the product, as listed in the regulations specified by an agency and specification or any local market regulations.
label: Marlin and its derivatives

MARLIN
type: Allergen Type Code
Original Code Value: MAL
comment: Refers to the presence of Marlin and its derivatives in the product, as listed in the regulations specified in AllergenSpecificationAgency and AllergenSpecificationName.
label: Marlin and its Derivatives
deprecated: MAL

MELATONIN
type: Allergen Type Code
Original Code Value: MM
comment: Refers to the presence of Melatonin, a hormone secreted by the pineal gland that inhibits melanin formation and is thought to be concerned with regulating the reproductive cycle.
label: Melatonin
deprecated: MM

METHYL_2_OCTYNOATE
type: Allergen Type Code
Original Code Value: MO
comment: Refers to the presence of Methyl 2-Octynoate as listed in the regulations specified in AllergenSpecificationAgency and AllergenSpecificationName.
label: Methyl 2-Octynoate
deprecated: BQ

METHYL_HEPTIN_CARBONATE
type: Allergen Type Code
Original Code Value: BQ
comment: Refers to the presence of Methyl heptin carbonate as listed in the regulations specified in AllergenSpecificationAgency and AllergenSpecificationName
label: Methyl Heptin Carbonate
deprecated: BQ

MFD
type: Allergen Type Code
Original Code Value: MFD
comment: Refers to the presence of Milkfish and its Derivatives in the product. - Family/Genus/Species: Chanidae/Chanos/chanos - Also known as: False Trevalliesm Milkfish - Disclaimer: Refers to the presence of the allergen in the product, as listed in the regulations specified by an agency and specification or any local market regulations.
label: Milkfish and its derivatives

MH
type: Allergen Type Code
Original Code Value: MH
comment: Refers to the presence of 2-Methyl-5-hydroxyethylaminophenol in the product. - CAS Registry Number: 55302-96-0 - Also known as: - Disclaimer: Refers to the presence of the allergen in the product, as listed in the regulations specified by an agency and specification or any local market regulations.
label: 2-Methyl-5-hydroxyethylaminophenol

MILK
type: Allergen Type Code
Original Code Value: AM
comment: Refers to the presence of milk and their derivatives in the product, as listed in as listed in the regulations specified in AllergenSpecificationAgency and AllergenSpecificationName
label: Milk and Derivatives
deprecated: AM

MKF
type: Allergen Type Code
Original Code Value: MKF
comment: Refers to the presence of Monkfish (Anglerfish, Lotte) and its derivates in the product. - Family/Genus/Species: Lophiidae/Lophius/(various) - Also known as: American Angler, Angler, Anglerfish, Blackbellied Angelr, Blackfin Goosefish, Blackfin Monkfish, Devil Angelfish, Fishing-Frogs, Frog-Fish, Goosefish, Monkfish, Sea-Devils, Shortspine African Angelr, Yellow Goosefish, Yellow Goosfish - Disclaimer: Refers to the presence of the allergen in the product, as listed in the regulations specified by an agency and specification or any local market regulations.
label: Monkfish (Anglerfish, Lotte) and its derivatives

ML
type: Allergen Type Code
Original Code Value: ML
comment: Refers to the presence of lactose in the product. - Family/Genus/Species: - Also known as: Milk sugar, Lactobiose, 4-O-β-D-Galactopyranosyl-D-glucose - Disclaimer: Refers to the presence of the allergen in the product, as listed in the regulations specified by an agency and specification or any local market regulations.
label: Lactose

MM
type: Allergen Type Code
Original Code Value: MM
comment: Refers to the presence of Melatonin, a hormone secreted by the pineal gland that inhibits melanin formation and is thought to be concerned with regulating the reproductive cycle. - CAS Registry Number: 73-31-4 - Also known as: N-acetyl-5-methoxy tryptamine - Disclaimer: Refers to the presence of the allergen in the product, as listed in the regulations specified by an agency and specification or any local market regulations.
label: Melatonin

MMD
type: Allergen Type Code
Original Code Value: MMD
comment: Refers to the presence of Matsutake mushroom and its derivatives in the product. - Family/Genus/Species: Tricholoma matsutake. - Also known as: - Disclaimer: Refers to the presence of the allergen in the product, as listed in the regulations specified by an agency and specification or any local market regulations.
label: Matsutake mushroom and its derivatives

MOD
type: Allergen Type Code
Original Code Value: MOD
comment: Refers to the presence of Mango and its derivatives in the product. - Family/Genus/Species: Mangifera. - Also known as: - Disclaimer: Refers to the presence of the allergen in the product, as listed in the regulations specified by an agency and specification or any local market regulations.
label: Mango and its derivatives

MOLLUSCS
type: Allergen Type Code
Original Code Value: UM
comment: Refers to the presence of molluscs and their derivatives in the product, as listed in as listed in the regulations specified in AllergenSpecificationAgency and AllergenSpecificationName
label: Molluscs and Their Derivatives
deprecated: UM

MONKFISH_(ANGLERFISH,_LOTTE)
type: Allergen Type Code
Original Code Value: MKF
comment: Refers to the presence of Monkfish (Anglerfish, Lotte) and its derivatives in the product, as listed in the regulations specified in AllergenSpecificationAgency and AllergenSpecificationName.
label: Monkfish (Anglerfish, Lotte) and its Derivatives
deprecated: MKF

MSS
type: Allergen Type Code
Original Code Value: MSS
comment: Refers to the presence of Mussels and its derivates in the product. - Family/Genus/Species: (various) - Also known as: American Angler, Bearded Horse Mussel, Blue Mussel, California Mussel, Chilean Mussel, Cholga Mussel, Mediterranean Mussel, Mussel, New Zealand Green Mussel, Northern Horse Mussel - Disclaimer: Refers to the presence of the allergen in the product, as listed in the regulations specified by an agency and specification or any local market regulations.
label: Mussels and its derivatives

MUSSELS
type: Allergen Type Code
Original Code Value: MSS
comment: Refers to the presence of Mussels and its derivatives in the product, as listed in the regulations specified in AllergenSpecificationAgency and AllergenSpecificationName.
label: Mussels and its Derivatives
deprecated: MSS

MUSTARD
type: Allergen Type Code
Original Code Value: BM
comment: Refers to the presence of mustard or their derivatives in the product, as listed in as listed in the regulations specified in AllergenSpecificationAgency and AllergenSpecificationName
label: Mustard and Derivatives
deprecated: BM

NC
type: Allergen Type Code
Original Code Value: NC
comment: Refers to the presence of cocoa and its derivatives in the product, as listed in in the product. - Family/Genus/Species: Theobroma cacao. - Also known as: Cacao. - Disclaimer: Refers to the presence of the allergen in the product, as listed in the regulations specified by an agency and specification or any local market regulations.
label: Cocoa and its derivatives

NE
type: Allergen Type Code
Original Code Value: NE
comment: Refers to the presence of Peas and its derivatives in the product. - Family/Genus/Species: Pisum sativum. - Also known as: - Disclaimer: Refers to the presence of the allergen in the product, as listed in the regulations specified by an agency and specification or any local market regulations.
label: Peas and its derivatives

NK
type: Allergen Type Code
Original Code Value: NK
comment: Refers to the presence of coriander and its derivatives in the product, as listed in in the product. - Family/Genus/Species: Coriandrum sativum. - Also known as: Chinese parsley, Dhania and Cilantro. - Disclaimer: Refers to the presence of the allergen in the product, as listed in the regulations specified by an agency and specification or any local market regulations.
label: Coriander and its derivatives

NL
type: Allergen Type Code
Original Code Value: NL
comment: Refers to the presence of Lupine and its derivatives in the product, as listed in in the product. - Family/Genus/Species: Lupinus. - Also known as: Lupin and Bluebonnet. - Disclaimer: Refers to the presence of the allergen in the product, as listed in the regulations specified by an agency and specification or any local market regulations.
label: Lupine and its derivatives

NM
type: Allergen Type Code
Original Code Value: NM
comment: Refers to the presence of corn and its derivatives in the product. - Family/Genus/Species: Zea mays. - Also known as: Maize. - Disclaimer: Refers to the presence of the allergen in the product, as listed in the regulations specified by an agency and specification or any local market regulations.
label: Corn and Its derivatives

NO_DECLARED_ALLERGENS
type: Allergen Type Code
Original Code Value: X99
comment: Does not contain declaration obligatory allergens as listed in the regulations specified in AllergenSpecificationAgency and AllergenSpecificationName.
label: No Declaration Obligatory Allergens
deprecated: X99

NP
type: Allergen Type Code
Original Code Value: NP
comment: Refers to the presence of Pod fruits and its derivates in the product. - Family/Genus/Species: Fabaceae - Also known as: Legume. - Disclaimer: Refers to the presence of the allergen in the product, as listed in the regulations specified by an agency and specification or any local market regulations.
label: Pod Fruits and its derivatives

NR
type: Allergen Type Code
Original Code Value: NR
comment: Refers to the presence of Rye and its derivatives in the product. - Family/Genus/Species: Secale cereale. - Also known as: - Disclaimer: Refers to the presence of the allergen in the product, as listed in the regulations specified by an agency and specification or any local market regulations.
label: Rye and its derivatives

NW
type: Allergen Type Code
Original Code Value: NW
comment: Refers to the presence of carrot and its derivates in the product. - Family/Genus/Species: Daucus carota subsp. sativus. - Also known as: - Disclaimer: Refers to the presence of the allergen in the product, as listed in the regulations specified by an agency and specification or any local market regulations.
label: Carrots and its derivatives

OAT
type: Allergen Type Code
Original Code Value: GO
comment: Refers to the presence of oat and oat products (gluten containing grain) as listed in the regulations specified in AllergenSpecificationAgency and AllergenSpecificationName.
label: Oat and Oat Products
deprecated: GO

OCT
type: Allergen Type Code
Original Code Value: OCT
comment: Refers to the presence of Octopus and its derivates in the product. - Family/Genus/Species: Octopus - Also known as: Octopus, Giant Octopus, Veined Octopus, Common Octopus - Disclaimer: Refers to the presence of the allergen in the product, as listed in the regulations specified by an agency and specification or any local market regulations.
label: Octopus and its derivatives

OCTOPUS
type: Allergen Type Code
Original Code Value: OCT
comment: Refers to the presence of Octopus and its derivatives in the product, as listed in the regulations specified in AllergenSpecificationAgency and AllergenSpecificationName.
label: Octopus and its Derivatives
deprecated: OCT

OFD
type: Allergen Type Code
Original Code Value: OFD
comment: Refers to the presence of Oilfish and its Derivatives in the product. - Family/Genus/Species: Gempylidae/Ruvettus/pretiosus - Also known as: Oilfish - Disclaimer: Refers to the presence of the allergen in the product, as listed in the regulations specified by an agency and specification or any local market regulations.
label: Oilfish and its derivatives

OGD
type: Allergen Type Code
Original Code Value: OGD
comment: Refers to the presence of Orange and its derivatives in the product. - Family/Genus/Species: Rutaceae. - Also known as: - Disclaimer: Refers to the presence of the allergen in the product, as listed in the regulations specified by an agency and specification or any local market regulations.
label: Orange and its derivatives

ON
type: Allergen Type Code
Original Code Value: ON
comment: Refers to the presence of 1-Naphthol in the product. - CAS Registry Number: 90-15-3 - Also known as: α-naphthol - Disclaimer: Refers to the presence of the allergen in the product, as listed in the regulations specified by an agency and specification or any local market regulations.
label: 1-Naphthol

ORANGE_ROUGHY
type: Allergen Type Code
Original Code Value: ORR
comment: Refers to the presence of Orange roughy and its derivatives in the product, as listed in the regulations specified in AllergenSpecificationAgency and AllergenSpecificationName.
label: Orange roughy and its Derivatives
deprecated: ORR

ORR
type: Allergen Type Code
Original Code Value: ORR
comment: Refers to the presence of Orange roughy and its derivates in the product. - Family/Genus/Species: Trachichthyidae/Hoplostethus/H. atlanticus - Also known as: Orange Roughy, Red Roughy, Alimehead, Deep Sea Perch - Disclaimer: Refers to the presence of the allergen in the product, as listed in the regulations specified by an agency and specification or any local market regulations.
label: Orange roughy and its derivatives

OYS
type: Allergen Type Code
Original Code Value: OYS
comment: Refers to the presence Oysters and its derivates in the product. - Family/Genus/Species: Ostreidae or Pteriidae/(various) - Also known as: Chilean Oyster, Eastern Oyster, Edible Oyster, European Flat Oyster, Kumamoto Oyster, New Zealand Dredge Oyster, New Zealand Rock Oyster, Olympia Oyster, Pacific Oyster, Portuguese Oyster, Sydney Rock Oyster, Tautog - Disclaimer: Refers to the presence of the allergen in the product, as listed in the regulations specified by an agency and specification or any local market regulations.
label: Oysters and its derivatives

OYSTERS
type: Allergen Type Code
Original Code Value: OYS
comment: Refers to the presence Oysters and its derivatives in the product, as listed in the regulations specified in AllergenSpecificationAgency and AllergenSpecificationName.
label: Oysters and its Derivatives
deprecated: OYS

P-METHYLAMINOPHENOL
type: Allergen Type Code
Original Code Value: PM
comment: Refers to the presence of p-Methylaminophenol as listed in the regulations specified in AllergenSpecificationAgency and AllergenSpecificationName.
label: p-Methylaminophenol
deprecated: PM

P-PHENYLENEDIAMINE
type: Allergen Type Code
Original Code Value: PP
comment: Refers to the presence of p-Phenylenediamine in the product as listed in the regulations specified in AllergenSpecificationAgency and AllergenSpecificationName.
label: p-Phenylenediamine
deprecated: PP

PEANUTS
type: Allergen Type Code
Original Code Value: AP
comment: Refers to the presence of peanuts and their derivatives in the product, as listed in as listed in the regulations specified in AllergenSpecificationAgency and AllergenSpecificationName
label: Peanuts and Their Derivatives
deprecated: AP

PEAS
type: Allergen Type Code
Original Code Value: NE
comment: Refers to the presence of peas and pea products as listed in the regulations specified in AllergenSpecificationAgency and AllergenSpecificationName.
label: Peas and Pea Products
deprecated: NE

PECAN_NUTS
type: Allergen Type Code
Original Code Value: SP
comment: Refers to the presence of pecan nut and pecan nut products as listed in the regulations specified in AllergenSpecificationAgency and AllergenSpecificationName.
label: Pecan Nut and Pecan Nut
deprecated: SP

PER
type: Allergen Type Code
Original Code Value: PER
comment: Refers to the presence of Periwinkle and its derivates in the product. - Family/Genus/Species: Littorina. - Also known as: - Disclaimer: Refers to the presence of the allergen in the product, as listed in the regulations specified by an agency and specification or any local market regulations.
label: Periwinkle and its derivatives

PERCH
type: Allergen Type Code
Original Code Value: ANO
comment: Refers to the presence of Perch and their derivatives in the product, as listed as listed in the regulations specified in AllergenSpecificationAgency and AllergenSpecificationName.
label: Perch and its Derivatives
deprecated: ANO

PERIWINKLE
type: Allergen Type Code
Original Code Value: PER
comment: Refers to the presence of Periwinkle and its derivatives in the product, as listed in the regulations specified in AllergenSpecificationAgency and AllergenSpecificationName.
label: Periwinkle and its Derivatives
deprecated: PER

PFD
type: Allergen Type Code
Original Code Value: PFD
comment: Refers to the presence of Puffer and its Derivatives in the product. - Family/Genus/Species: Tetraodontidae/(various) - Also known as: Balloonfish, Bandtail Puffer, Blowfish, Blowies, Blunthead Puffer, Bubblefish, Bullseye Puffer, Checkered Puffer, Common Puffers, Globefish, Honey toads, Least Puffer, Longnose Puffer, Marbled Puffer, Moontail Blassop, Northern Puffer, Oceanic Puffer, Pufferfish, Puffers, Sea squab, Sharpnosed Puffers, Smooth Puffer, Southern Puffer, Sugar toads, Swellfish, Toadfish, Toadies - Disclaimer: Refers to the presence of the allergen in the product, as listed in the regulations specified by an agency and specification or any local market regulations.
label: Puffer fish and its derivatives

PGT
type: Allergen Type Code
Original Code Value: PGT
comment: Refers to the presence of Patagonian Toothfish and its Derivatives in the product. - Family/Genus/Species: Nototheniidae/Dissostichus/eleginoides - Also known as: Patagonian Toothfish - Disclaimer: Refers to the presence of the allergen in the product, as listed in the regulations specified by an agency and specification or any local market regulations.
label: Patagonian Toothfish and its derivatives

PHD
type: Allergen Type Code
Original Code Value: PHD
comment: Refers to the presence of Peach and its derivatives in the product. - Family/Genus/Species: Prunus persica. - Also known as: - Disclaimer: Refers to the presence of the allergen in the product, as listed in the regulations specified by an agency and specification or any local market regulations.
label: Peach and its derivatives

PIKE
type: Allergen Type Code
Original Code Value: ADP
comment: Refers to the presence of Pike and their derivatives in the product, as listed as listed in the regulations specified in AllergenSpecificationAgency and AllergenSpecificationName.
label: Pike and its Derivatives
deprecated: ADP

PILI_NUTS
type: Allergen Type Code
Original Code Value: SK
comment: Refers to the presence of Pili nuts [Canarium ovatum (Burseraceae)] and their derivatives in the product, as listed as listed in the regulations specified in AllergenSpecificationAgency and AllergenSpecificationName.
label: Pili Nuts and Their Derivatives
deprecated: SK

PINE_NUTS
type: Allergen Type Code
Original Code Value: PN
comment: Refers to the presence of Pine Nuts and their derivatives as listed in the regulations specified in AllergenSpecificationAgency and AllergenSpecificationName.
label: Pine Nut and Their Derivatives
deprecated: PN

PISTACHIOS
type: Allergen Type Code
Original Code Value: ST
comment: Refers to the presence of pistachio and pistachio products as listed in the regulations specified in AllergenSpecificationAgency and AllergenSpecificationName.
label: Pistachio and Pistachio Products
deprecated: ST

PLAICE
type: Allergen Type Code
Original Code Value: PLC
comment: Refers to the presence of Plaice and its derivatives in the product, as listed in the regulations specified in AllergenSpecificationAgency and AllergenSpecificationName.
label: Plaice and its Derivatives
deprecated: PLC

PLC
type: Allergen Type Code
Original Code Value: PLC
comment: Refers to the presence of Plaice and its derivates in the product. - Family/Genus/Species: Pleuronectidae/(various) - Also known as: American Plaice, Alaskan Plaice, European Plaice, Scale-eye Plaice, Summer Plaice - Disclaimer: Refers to the presence of the allergen in the product, as listed in the regulations specified by an agency and specification or any local market regulations.
label: Plaice and its derivatives

PM
type: Allergen Type Code
Original Code Value: PM
comment: Refers to the presence of p-Methylaminophenol in the product. - CAS Registry Number: 55-55-0 - Also known as: - Disclaimer: Refers to the presence of the allergen in the product, as listed in the regulations specified by an agency and specification or any local market regulations.
label: p-Methylaminophenol

PN
type: Allergen Type Code
Original Code Value: PN
comment: Refers to the presence of Pine nuts and its derivatives in the product. - Family/Genus/Species: Pinus. - Also known as: Pine seeds. - Disclaimer: Refers to the presence of the allergen in the product, as listed in the regulations specified by an agency and specification or any local market regulations.
label: Pine nuts and its derivatives

PO
type: Allergen Type Code
Original Code Value: PO
comment: Refers to the presence of Pork and its derivative in the product, in the product - Family/Genus/Species: - Also known as: - Disclaimer: Refers to the presence of the allergen in the product, as listed in the regulations specified by an agency and specification or any local market regulations.
label: Pork and its derivatives

POD_FRUITS
type: Allergen Type Code
Original Code Value: NP
comment: Refers to the presence of pod fruits and their derivatives in the product, as listed in as listed in the regulations specified in AllergenSpecificationAgency and AllergenSpecificationName
label: Pod Fruits Derivatives
deprecated: NP

POLLOCK
type: Allergen Type Code
Original Code Value: ADQ
comment: Refers to the presence of Pollock and their derivatives in the product, as listed as listed in the regulations specified in AllergenSpecificationAgency and AllergenSpecificationName.
label: Pollock and its Derivatives
deprecated: ADQ

POM
type: Allergen Type Code
Original Code Value: POM
comment: Refers to the presence of Pompano and its derivates in the product. - Family/Genus/Species: Carangidae subfamily Trachinotinae/Trachinotus/(various) - Also known as: African Pompano, Blackblotch Pompano, Cayenne Pompano, Derbio, Florida Pompano, Florida Pompano, Gafftopsail Pompano, Gafftopsail Pompano, Guinean Pompano, Indian Pompano, Largespotted Dart, Longfin Pompano, Marquesas Dart, Oyster Pompano, Paloma Pompano, Paloma Pompano, Palometa, Palometa, Palometta Permit, Permit, Permit, Plata Pompano, Pompano, Shortfin Pompano, Smallspotted Dart, Snubnose Pompano, Snubnose Pompano, Southern Pompano, Steel Pompano, Swallowtail Dart - Disclaimer: Refers to the presence of the allergen in the product, as listed in the regulations specified by an agency and specification or any local market regulations.
label: Pompano and its derivatives

POMPANO
type: Allergen Type Code
Original Code Value: POM
comment: Refers to the presence of Pompano and its derivatives in the product, as listed in the regulations specified in AllergenSpecificationAgency and AllergenSpecificationName.
label: Pompano and its Derivatives
deprecated: POM

POPPY_SEEDS
type: Allergen Type Code
Original Code Value: PS
comment: Refers to the presence of Poppy Seeds or their derivatives in the product as listed in the regulations specified in AllergenSpecificationAgency and AllergenSpecificationName.
label: Poppy Seeds and Their Derivatives
deprecated: PS

PORGY
type: Allergen Type Code
Original Code Value: PRG
comment: Refers to the presence of Porgy and its derivatives in the product, as listed in the regulations specified in AllergenSpecificationAgency and AllergenSpecificationName.
label: Porgy and its Derivatives
deprecated: PRG

PORK
type: Allergen Type Code
Original Code Value: PO
comment: Refers to the presence of pork and its derivative in the product, as listed in the regulations specified in AllergenSpecificationAgency and AllergenSpecificationName.
label: Pork and its Derivatives
deprecated: PO

PP
type: Allergen Type Code
Original Code Value: PP
comment: Refers to the presence of p-Phenylenediamine in the product in the product. - CAS Registry Number: 106-50-3 - Also known as: - Disclaimer: Refers to the presence of the allergen in the product, as listed in the regulations specified by an agency and specification or any local market regulations.
label: p-Phenylenediamine

PRAWNS
type: Allergen Type Code
Original Code Value: ABK
comment: Refers to the presence of Prawns and their derivatives in the product, as listed as listed in the regulations specified in AllergenSpecificationAgency and AllergenSpecificationName.
label: Prawns and their Derivatives
deprecated: ABK

PRG
type: Allergen Type Code
Original Code Value: PRG
comment: Refers to the presence of Porgy and its derivates in the product. - Family/Genus/Species: Sparidae/(various) - Also known as: Dentex, Grass Porgy, Longspine Porgy, Madai, Panga, Pinfish, Porgy, Puntazzo, Red Porgy, River Bream, Scup, Sea Bream, Sheepshead, Silver Porgy, Spotted Pinfish, Squirefish, Whitebone Porgy - Disclaimer: Refers to the presence of the allergen in the product, as listed in the regulations specified by an agency and specification or any local market regulations.
label: Porgy and its derivatives

PS
type: Allergen Type Code
Original Code Value: PS
comment: Refers to the presence of Poppy seeds or its derivatives in the product in the product. - Family/Genus/Species: Papaver somniferum. - Also known as: - Disclaimer: Refers to the presence of the allergen in the product, as listed in the regulations specified by an agency and specification or any local market regulations.
label: Poppy Seeds and its derivatives

PULSES
type: Allergen Type Code
Original Code Value: SX
comment: Refers to the presence of pulses. An annual leguminous crop yielding from one to twelve seeds of variable size, shape, and colour within a pod. Pulses are used for food and animal feed. The term 'pulse', as used by the Food and Agricultural Organization (FAO), is reserved for crops harvested solely for the dry seed. This excludes green beans and green peas, which are considered vegetable crops. Also excluded are crops that are mainly grown for oil extraction
label: Pulses
deprecated: SX

QUA
type: Allergen Type Code
Original Code Value: QUA
comment: Refers to the presence of Quahaugs and its derivates in the product. - Family/Genus/Species: Veneridae/Mercenaria/M. mercenaria - Also known as: Cherrystones, Chowder Clams, Countnecks, Quahog, Quahaug, Hard-shell Clam, Ocean Quahog, Peanut Clam, Round Clam, Topnecks, Southern Quahog - Disclaimer: Refers to the presence of the allergen in the product, as listed in the regulations specified by an agency and specification or any local market regulations.
label: Quahaugs and its derivatives

QUAHAUGS
type: Allergen Type Code
Original Code Value: QUA
comment: Refers to the presence of Quahaugs and its derivatives in the product, listed as listed in the regulations specified in AllergenSpecificationAgency and AllergenSpecificationName.
label: Quahaugs and its Derivatives
deprecated: QUA

QUEENSLAND_NUTS
type: Allergen Type Code
Original Code Value: SQ
comment: Refers to the presence of queensland nut and queensland nut products as listed in the regulations specified in AllergenSpecificationAgency and AllergenSpecificationName.
label: Queensland Nut and Queensland Nut Products
deprecated: AllergenTypeCode-SQ

ROCKFISH
type: Allergen Type Code
Original Code Value: ROF
comment: Refers to the presence of Rockfish and its derivatives in the product, as listed in the regulations specified in AllergenSpecificationAgency and AllergenSpecificationName.
label: Rockfish and its Derivatives
deprecated: ROF

ROF
type: Allergen Type Code
Original Code Value: ROF
comment: Refers to the presence of Rockfish and its derivates in the product. Rockfish is a common term for several species of fish, referring to their tendency to hide among rocks. - Family/Genus/Species: (various) - Also known as: Aurora Rockfish, Bank Rockfish, Black & Yellow Rockfish, Black Rockfish, Blackgill Rockfish, Blue Rockfish, Bocaccio, Bronzespotted Rockfish, Brown Rockfish, Calico Rockfish, Canary Rockfish, Chameleon Rockfish, Chilipepper (Fish), China Rockfish, Copper Rockfish, Cowcod, Darkblotched Rockfish, Dusky Rockfish, Dwarf-red Rockfish, Flag Rockfish, Freckled Rockfish, Gopher Rockfish, Grass Rockfish, Greenblotched Rockfish, Greenspotted Rockfish, Greenstriped Rockfish, Halfbanded Rockfish, Harlequin Rockfish, Honeycomb Rockfish, Kelp Rockfish, Mexican Rockfish, Northern Rockfish, Olive Rockfish, Pink Rockfish, Pinkrose Rockfish, Puget Sound Rockfish, Pygmy Rockfish, Quillback Rockfish, Red Rockfish, Redbanded Rockfish, Redstripe Rockfish, Rockfish, Rosethorn Rockfish, Rosy Rockfish, Rougheye Rockfish, Semaphore Rockfish, Sharpchin Rockfish, Shortbelly Rockfish, Shortraker Rockfish, Silvergray Rockfish, Speckled Rockfish, Splitnose Rockfish, Squarespot Rockfish, Starry Rockfish, Stripetail Rockfish, Swordspine Rockfish, Tiger Rockfish, Treefish, Vermilion Rockfish, Widow Rockfish, Yelloweye Rockfish, Yellowmouth Rockfish, Yellowtail Rockfish - Disclaimer: Refers to the presence of the allergen in the product, as listed in the regulations specified by an agency and specification or any local market regulations.
label: Rockfish and its derivatives

RYE
type: Allergen Type Code
Original Code Value: NR
comment: Refers to the presence of rye and their derivatives in the product, as listed in as listed in the regulations specified in AllergenSpecificationAgency and AllergenSpecificationName
label: Rye and Derivatives
deprecated: NR

SA
type: Allergen Type Code
Original Code Value: SA
comment: Refers to the presence of almonds and its derivatives in the product. - Family/Genus/Species: Prunus dulcis. - Also known as: - Disclaimer: Refers to the presence of the allergen in the product, as listed in the regulations specified by an agency and specification or any local market regulations.
label: Almonds and its derivatives

SAD
type: Allergen Type Code
Original Code Value: SAD
comment: Refers to the presence of Sapucaia nuts and its derivatives in the product. - Family/Genus/Species: Lecythis zabucajo. - Also known as: paradise nut. - Disclaimer: Refers to the presence of the allergen in the product, as listed in the regulations specified by an agency and specification or any local market regulations.
label: Sapucaia nuts and its derivatives

SALICYLATE
type: Allergen Type Code
Original Code Value: SU
comment: Refers to the presence of Salicylate, a salt or ester of salicylic acid.
label: Salicylate
deprecated: SU

SALMON
type: Allergen Type Code
Original Code Value: ADR
comment: Refers to the presence of Salmon and their derivatives in the product, as listed as listed in the regulations specified in AllergenSpecificationAgency and AllergenSpecificationName.
label: Salmon and its Derivatives
deprecated: ADR

SAR
type: Allergen Type Code
Original Code Value: SAR
comment: Refers to the presence of Sardine and its derivates in the product. - Family/Genus/Species: Clupeidae/(various) - Also known as: Australian Pilchard, European Pilchard, Japanese Pilchard, Pacific Sardine, South African Pilchard, False Pilchard, Fringescale Sardinella, Japanese Scaled Sardine, Oil Sardine, Orangespot Sardine, Perforated-scale Sardine, Redear Sardine, Scaled Sardine, Spanish Sardine, White Sardine - Disclaimer: Refers to the presence of the allergen in the product, as listed in the regulations specified by an agency and specification or any local market regulations.
label: Sardine and its derivatives

SARDINE
type: Allergen Type Code
Original Code Value: SAR
comment: Refers to the presence of Sardine and its derivatives in the product, as listed in the regulations specified in AllergenSpecificationAgency and AllergenSpecificationName.
label: Sardine and its Derivatives
deprecated: SAR

SB
type: Allergen Type Code
Original Code Value: SB
comment: Refers to the presence of Seed products and its derivatives in the product - Family/Genus/Species: - Also known as: - Disclaimer: Refers to the presence of the allergen in the product, as listed in the regulations specified by an agency and specification or any local market regulations.
label: Seed Products and its derivatives

SC
type: Allergen Type Code
Original Code Value: SC
comment: Refers to the presence of Cashews and its derivatives in the product. - Family/Genus/Species: Anacardium occidentale. - Also known as: Cashew nut. - Disclaimer: Refers to the presence of the allergen in the product, as listed in the regulations specified by an agency and specification or any local market regulations.
label: Cashews and its derivatives

SCA
type: Allergen Type Code
Original Code Value: SCA
comment: Refers to the presence of Scallops and its derivates in the product. - Family/Genus/Species: Pectinidae/Pecten/(various) - Also known as: Atlantic Calico Scallop, Atlantic Scallop, Australian Scallop, Bay Scallop, Common Japanese Scallop, Farrer's Scallop, Giant Scallop, Great Scallop, Iceland Scallop, Lined Scallop, New Zealand Commercial Scallop, Nucleus Scallop, Pacific Calico Scallop, Paper Scallop, Patagonian Scallop, Peruvian Calico Scallop, Peruvian Scallop, Queen Scallop, Reddish Scallop, Red-ribbed Scallop, San Diego Scallop, Scallop, Scallop Saucer, Sea Scallop, Southern Queen Scallop, Southern Scallop, Spiny Scallop, Thailand Moon scallop, Weathervane Scallop, White Scallop, Zigzag Scallop - Disclaimer: Refers to the presence of the allergen in the product, as listed in the regulations specified by an agency and specification or any local market regulations.
label: Scallops and its derivatives

SCALLOPS
type: Allergen Type Code
Original Code Value: SCA
comment: Refers to the presence of Scallops and its derivatives in the product, as listed in the regulations specified in AllergenSpecificationAgency and AllergenSpecificationName.
label: Scallops and its Derivatives
deprecated: SCA

SD
type: Allergen Type Code
Original Code Value: SD
comment: Refers to the presence of beech nuts and its derivatives in the product. - Family/Genus/Species: Fagus. - Also known as: Beech mast. - Disclaimer: Refers to the presence of the allergen in the product, as listed in the regulations specified by an agency and specification or any local market regulations.
label: Beech Nuts and its derivatives

SDF
type: Allergen Type Code
Original Code Value: SDF
comment: Refers to the presence of Scad fish and its derivatives in the product. - Family/Genus/Species: Carangidae (order Perciformes) - Also known as: Mackerel Scad, Amberjack Scad, Jack Scad..etc.- Disclaimer: Refers to the presence of the allergen in the product, as listed in the regulations specified by an agency and specification or any local market regulations.
label: Scad fish and its derivatives

SE
type: Allergen Type Code
Original Code Value: SE
comment: Refers to the presence of butternuts and its derivatives in the product. - Family/Genus/Species: Juglans cinerea. - Also known as: White walnut. - Disclaimer: Refers to the presence of the allergen in the product, as listed in the regulations specified by an agency and specification or any local market regulations.
label: Butternuts and its derivatives

SEED_PRODUCTS
type: Allergen Type Code
Original Code Value: SB
comment: Refers to the presence of seed products as listed in the regulations specified in AllergenSpecificationAgency and AllergenSpecificationName
label: Seed Products
deprecated: SB

SESAME_SEEDS
type: Allergen Type Code
Original Code Value: AS
comment: Refers to the presence of sesame seeds or their derivatives in the product, as listed in as listed in the regulations specified in AllergenSpecificationAgency and AllergenSpecificationName
label: Sesame Seeds or Their Derivatives
deprecated: AS

SF
type: Allergen Type Code
Original Code Value: SF
comment: Refers to the presence of Chinquapins and its derivatives in the product. - Family/Genus/Species: Castanea pumila. - Also known as: Allegheny chinquapin, American chinquapin and Dwarf Chetsnut. - Disclaimer: Refers to the presence of the allergen in the product, as listed in the regulations specified by an agency and specification or any local market regulations.
label: Chinquapins and its derivatives

SFD
type: Allergen Type Code
Original Code Value: SFD
comment: Refers to the presence of Swai and its Derivatives in the product. - Family/Genus/Species: Pangasiidae/Pangasianodon/hypophthalmus - Also known as: Sutchi Catfish, Swai, Sutchi, Striped Pangasius, Tra - Disclaimer: Refers to the presence of the allergen in the product, as listed in the regulations specified by an agency and specification or any local market regulations.
label: Swai fish and its derivatives

SFT
type: Allergen Type Code
Original Code Value: SFT
comment: Refers to the presence of Spinefoot and its Derivatives in the product. - Family/Genus/Species: Siganidae/Siganus/(various) - Also known as: Bluespotted Spinefish, Foxface, Pearly Spinefoot, Rabbitfish, Streaked Spinefoot, Spinefoot - Disclaimer: Refers to the presence of the allergen in the product, as listed in the regulations specified by an agency and specification or any local market regulations.
label: Spinefoot fish and its derivatives

SG
type: Allergen Type Code
Original Code Value: SG
comment: Refers to the presence of Ginkgo nuts and its derivatives in the product. - Family/Genus/Species: Ginkgo. - Also known as: Ginkgo seeds, Gingko. - Disclaimer: Refers to the presence of the allergen in the product, as listed in the regulations specified by an agency and specification or any local market regulations.
label: Ginkgo Nuts and its derivatives

SH
type: Allergen Type Code
Original Code Value: SH
comment: Refers to the presence of Hazelnuts and its derivatives in the product. - Family/Genus/Species: Corylus. - Also known as: Cobnuts, Filberts. - Disclaimer: Refers to the presence of the allergen in the product, as listed in the regulations specified by an agency and specification or any local market regulations.
label: Hazelnuts and its derivatives

SHARK
type: Allergen Type Code
Original Code Value: SHK
comment: Refers to the presence of Shark and its derivatives in the product, as listed in the regulations specified in AllergenSpecificationAgency and AllergenSpecificationName.
label: Shark and its Derivatives
deprecated: SHK

SHD
type: Allergen Type Code
Original Code Value: SHD
comment: Refers to the presence of Sheephead and its Derivatives in the product. - Family/Genus/Species: Labridae/Semicossyphus/darwini or pulcher or reticulatus - Also known as: Sheephead, California Sheephead, Galápagos sheephead, Goldspot sheepshead, Asian sheepshead wrasse - Disclaimer: Refers to the presence of the allergen in the product, as listed in the regulations specified by an agency and specification or any local market regulations.
label: Sheephead fish and its derivatives

SHEA_NUTS
type: Allergen Type Code
Original Code Value: SJ
comment: Refers to the presence of Shea nuts [Vitellaria paradoxa C.F. Gaertn. (Sapotaceae)] and their derivatives in the product, as listed as listed in the regulations specified in AllergenSpecificationAgency and AllergenSpecificationName.
label: Shea Nuts and Their Derivatives
deprecated: SJ

SHELLFISH
type: Allergen Type Code
Original Code Value: UN
comment: Refers to the presence of shellfish and its derivatives as listed in the regulations specified in AllergenSpecificationAgency and AllergenSpecificationName.
label: Shellfish and its Derivatives
deprecated: UN

SHK
type: Allergen Type Code
Original Code Value: SHK
comment: Refers to the presence of Shark and its derivates in the product. - Family/Genus/Species: (various) - Also known as: Atlantic Angel Shark, Basking Shark, Bigeye Thresher Shark, Bignose Shark, Black Dogfish, Blacknose Shark, Blacktip Reef Shark, Blacktip Shark, Blue Shark, Bonnethead, Brown Smoothhound, Bull Shark, Catshark, Common Thresher Shark, Dogfish Shark, Dusky Shark, Finetooth Shark, Gray Reef Shark, Great Hammerhead, Great White Shark, Grey Smoothhound, Hammerhead Shark, Large Spotted Dogfish, Lemon Shark, Leopard Shark, Lesser Spotted Dogfish, Longfin Mako Shark, Mako Shark, Narrowtoothed Shark, Night Shark, Northern Dogfish, Pacific Angel Shark, Pelagic Thresher Shark, Porbeagle, Reef Shark, Salmon Shark, Sandbar Shark, Scalloped Hammerhead, School Shark, Sevengill Shark, Shortfin Mako Shark, Silky Shark, Silvertip Shark, Sixgill Shark, Smalleye Hammerhead, Smalltail Shark, Smooth Dogfish, Smooth Hammerhead, Spinner Shark, Spiny Dogfish, Thresher Shark, Tiger Shark, White Shark, Whitetip Reef Shark, Whitetip Shark - Disclaimer: Refers to the presence of the allergen in the product, as listed in the regulations specified by an agency and specification or any local market regulations.
label: Shark and its derivatives

SHRIMP
type: Allergen Type Code
Original Code Value: ABL
comment: Refers to the presence of Shrimp and their derivatives in the product, as listed as listed in the regulations specified in AllergenSpecificationAgency and AllergenSpecificationName.
label: Shrimp and its Derivatives
deprecated: ABL

SI
type: Allergen Type Code
Original Code Value: SI
comment: Refers to the presence of hickory nuts and its derivatives in the product. - Family/Genus/Species: Carya. - Also known as: - Disclaimer: Refers to the presence of the allergen in the product, as listed in the regulations specified by an agency and specification or any local market regulations.
label: Hickory Nuts and its derivatives

SJ
type: Allergen Type Code
Original Code Value: SJ
comment: Refers to the presence of Shea nuts and its derivatives in the product. - Family/Genus/Species: Vitellaria paradoxa. - Also known as: Shi nut. - Disclaimer: Refers to the presence of the allergen in the product, as listed in the regulations specified by an agency and specification or any local market regulations.
label: Shea Nuts and its derivatives

SK
type: Allergen Type Code
Original Code Value: SK
comment: Refers to the presence of Pili nuts and its derivatives in the product. - Family/Genus/Species: Canarium ovatum. - Also known as: Pili seeds. - Disclaimer: Refers to the presence of the allergen in the product, as listed in the regulations specified by an agency and specification or any local market regulations.
label: Pili Nuts and its derivatives

SL
type: Allergen Type Code
Original Code Value: SL
comment: Refers to the presence of Lichee nuts and its derivatives in the product. - Family/Genus/Species: Litchi chinensis. - Also known as: Lichee seeds. - Disclaimer: Refers to the presence of the allergen in the product, as listed in the regulations specified by an agency and specification or any local market regulations.
label: Lichee Nuts and its derivatives

SM
type: Allergen Type Code
Original Code Value: SM
comment: Refers to the presence of Macadamia nuts and its derivatives in the product. - Family/Genus/Species: Macadamia. - Also known as: Queensland nut, Bush nut, Maroochi nut, Bauple nut and Hawaii nut. - Disclaimer: Refers to the presence of the allergen in the product, as listed in the regulations specified by an agency and specification or any local market regulations.
label: Macadamia Nuts and its derivatives

SMELT
type: Allergen Type Code
Original Code Value: SMT
comment: Refers to the presence of Smelt and its derivatives in the product, as listed in the regulations specified in AllergenSpecificationAgency and AllergenSpecificationName.
label: Smelt and its Derivatives
deprecated: SMT

SMF
type: Allergen Type Code
Original Code Value: SMF
comment: Refers to the presence of Schoolmaster and its Derivatives in the product. - Family/Genus/Species: Lutjanidae/Lutjanus/apodus - Also known as: Schoolmaster, Schoolmaster snapper - Disclaimer: Refers to the presence of the allergen in the product, as listed in the regulations specified by an agency and specification or any local market regulations.
label: Schoolmaster fish and its derivatives

SMR
type: Allergen Type Code
Original Code Value: SMR
comment: Refers to the presence of Salmon roe and its derivatives in the product, as listed in in the product. - Family/Genus/Species: Salmo - Also known as: Salmon caviar, red caviar, or ikura - Disclaimer: Refers to the presence of the allergen in the product, as listed in the regulations specified by an agency and specification or any local market regulations.
label: Salmon roe

SMT
type: Allergen Type Code
Original Code Value: SMT
comment: Refers to the presence of Smelt and its derivates in the product. - Family/Genus/Species: Osmeridae/(various) - Also known as: Arctic Smelt, Argetine Smelt, Austrailian Smelt, Ayu, Big-Scale Smelt, Cucumberfish, Deepsea Smelt, Delta Smelt, Eulachon, European Smelt, Freshwater Smelt, Great Silver Smelt, Herring Smelt, Jacksmelt, Lesser Silver Smelt, Longfin Smelt, New Zealand Smelt, Night Smelt, Rainbow Smelt, Seep-sea Smelt, Smelt, Surf Smelt, Topsmelt, Typical Smelt, Whitebait Smelt - Disclaimer: Refers to the presence of the allergen in the product, as listed in the regulations specified by an agency and specification or any local market regulations.
label: Smelt and its derivatives

SN
type: Allergen Type Code
Original Code Value: SN
comment: Refers to the presence of chestnuts and its derivatives in the product. - Family/Genus/Species: Castanea. - Also known as: Sardian nut, Jupiter's nut, and Spanish chestnut. - Disclaimer: Refers to the presence of the allergen in the product, as listed in the regulations specified by an agency and specification or any local market regulations.
label: Chestnuts and its derivatives

SNAPPER
type: Allergen Type Code
Original Code Value: ADS
comment: Refers to the presence of Snapper and their derivatives in the product, as listed as listed in the regulations specified in AllergenSpecificationAgency and AllergenSpecificationName.
label: Snapper and its Derivatives
deprecated: ADS

SO
type: Allergen Type Code
Original Code Value: SO
comment: Refers to the presence of coconuts and its derivatives in the product. - Family/Genus/Species: Cocos nucifera. - Also known as: - Disclaimer: Refers to the presence of the allergen in the product, as listed in the regulations specified by an agency and specification or any local market regulations.
label: Coconuts and its derivatives

SOLE
type: Allergen Type Code
Original Code Value: ADT
comment: Refers to the presence of Sole and their derivatives in the product, as listed as listed in the regulations specified in AllergenSpecificationAgency and AllergenSpecificationName.
label: Sole and its Derivatives
deprecated: ADT

SOYBEANS
type: Allergen Type Code
Original Code Value: AY
comment: Refers to the presence of soybeans and their derivatives in the product, as listed in as listed in the regulations specified in AllergenSpecificationAgency and AllergenSpecificationName
label: Soybeans and Their Derivatives
deprecated: AY

SP
type: Allergen Type Code
Original Code Value: SP
comment: Refers to the presence of Pecan nuts and its derivatives in the product. - Family/Genus/Species: Carya illinoinensis. - Also known as: - Disclaimer: Refers to the presence of the allergen in the product, as listed in the regulations specified by an agency and specification or any local market regulations.
label: Pecan Nuts and its derivatives

SPELT
type: Allergen Type Code
Original Code Value: GS
comment: Refers to the presence of spelt and spelt products (gluten containing grain) as listed in the regulations specified in AllergenSpecificationAgency and AllergenSpecificationName.
label: Spelt and Spelt Products
deprecated: GS

SPF
type: Allergen Type Code
Original Code Value: SPF
comment: Refers to the presence of Scorpionfish and its Derivatives in the product. - Family/Genus/Species: Scorpaenidae/(various) - Also known as: California Scorpinfish, Dragonfish, False Jacopever, Firefish, Hunchback Scorpionfish, Large-headed Scorpionfish, Lionfish, Orange Scorpionfish, Plumed Scorpionfish, Stingfish, Turkeyfish - Disclaimer: Refers to the presence of the allergen in the product, as listed in the regulations specified by an agency and specification or any local market regulations.
label: Scorpionfish and its derivatives

SQU
type: Allergen Type Code
Original Code Value: SQU
comment: Refers to the presence of Squid (Calamari) and its derivates in the product. - Family/Genus/Species: (various) - Also known as: Angola Flying Squid, Argentine Shortfin Squid, Armhook Squid , Arrow Squid, Atlantic Brief Squid, Beka Squid, Bigeye Squid, Bigfin Reef Squid, Bigfin Squid , Bobtail Squid , Bottletail Squid , Bush-club Squid, Calamari, California Market Squid, Cape Horn Squid, Caribbean Reef Squid, Cock-eyed Squid , Cuttlefish , Dwarf Bobtail Squid, European Flying Squid, European Squid, Fire Squid , Firefly Squid , Flying Squid, Giant Squid , Glacial Squid , Glass Squid, Grimaldi scaled Squid , Hooked Squid , Indian Squid, Japanese Flying Squid, Joubin's Squid , Jumbo Squid, Longfin Inshore Squid, Magistrate Armhook Squid, Midsize Squid, Mitre Squid, Neritic Squid, Northern Shortfin Squid, Octopus Squid , Panama Brief Squid, Patagonian Inshore Squid, Purpleback Flying Squid, Pygmy Squid , Pyjama Squid , Ram's horn Squid , Sharpear enope Squid , Southern Reef Squid, Southern Shortfin Squid, Stout Bobtail Squid, Wellington Flying Squid, Whip-lash Squid - Disclaimer: Refers to the presence of the allergen in the product, as listed in the regulations specified by an agency and specification or any local market regulations.
label: Squid (Calamari) and its derivatives

SQUID_(CALAMARI)
type: Allergen Type Code
Original Code Value: SQU
comment: Refers to the presence of Squid (Calamari) and its derivatives in the product, as listed in the regulations specified in AllergenSpecificationAgency and AllergenSpecificationName.
label: Squid (Calamari) and its Derivatives
deprecated: SQU

SR
type: Allergen Type Code
Original Code Value: SR
comment: Refers to the presence of brazil nuts and its derivatives in the product. - Family/Genus/Species: Bertholletia excelsa. - Also known as: Castanha. - Disclaimer: Refers to the presence of the allergen in the product, as listed in the regulations specified by an agency and specification or any local market regulations.
label: Brazil Nuts and its derivatives

SS
type: Allergen Type Code
Original Code Value: SS
comment: Refers to the presence of Sunflower seeds or its derivatives in the product in the product. - Family/Genus/Species: Helianthus - Also known as: - Disclaimer: Refers to the presence of the allergen in the product, as listed in the regulations specified by an agency and specification or any local market regulations.
label: Sunflower Seeds and its derivatives

ST
type: Allergen Type Code
Original Code Value: ST
comment: Refers to the presence of Pistachio and its derivatives in the product. - Family/Genus/Species: Pistacia. - Also known as: - Disclaimer: Refers to the presence of the allergen in the product, as listed in the regulations specified by an agency and specification or any local market regulations.
label: Pistachios and its derivatives

STG
type: Allergen Type Code
Original Code Value: STG
comment: Refers to the presence of Sturgeon and its derivates in the product. - Family/Genus/Species: Acipenseridae/(various) - Also known as: Adriatic Sturgeon, Alabama Sturgeon, Amu Darya Sturgeon, Amur Sturgeon, Atlantic Sturgeon, Baikal Sturgeon, Beluga, Beluga Sturgeon, Bester, Chinese Sturgeon, Dwarf Sturgeon, European sea Sturgeon, Fringebarbel Sturgeon, Green Sturgeon, Gulf Sturgeon, Japanese Sturgeon, Kaluga Sturgeon, Lake Sturgeon, Pallid Sturgeon, Persian Sturgeon, Russian Sturgeon, Sakhalin Sturgeon, Shortnose Sturgeon, Shovelnose Sturgeon, Siberian Sturgeon, Starry Sturgeon, Stellate Sturgeon, Sterlet, Syr Darya Sturgeon, Thorn Sturgeon, White Sturgeon, Yangtze Sturgeon - Disclaimer: Refers to the presence of the allergen in the product, as listed in the regulations specified by an agency and specification or any local market regulations.
label: Sturgeon and its derivatives

STURGEON
type: Allergen Type Code
Original Code Value: STG
comment: Refers to the presence of Sturgeon and its derivatives in the product, as listed in the regulations specified in AllergenSpecificationAgency and AllergenSpecificationName.
label: Sturgeon and its Derivatives
deprecated: STG

SU
type: Allergen Type Code
Original Code Value: SU
comment: Refers to the presence of Salicylate and its derivatives in the product. - Family/Genus/Species: - Also known as: Salicylic acid. - Disclaimer: Refers to the presence of the allergen in the product, as listed in the regulations specified by an agency and specification or any local market regulations.
label: Salicylate and its derivatives

SULPHUR_DIOXIDE
type: Allergen Type Code
Original Code Value: AU
comment: Refers to the presence of sulphur dioxide and sulphites as listed in the regulations specified in AllergenSpecificationAgency and AllergenSpecificationName.
label: Sulphur Dioxide and Sulphites
deprecated: AU

SUNFLOWER_SEEDS
type: Allergen Type Code
Original Code Value: SS
comment: Refers to the presence of Sunflower Seeds or their derivatives in the product as listed in the regulations specified in AllergenSpecificationAgency and AllergenSpecificationName.
label: Sunflower Seeds and Their Derivatives
deprecated: SS

SW
type: Allergen Type Code
Original Code Value: SW
comment: Refers to the presence of Walnuts and its derivatives in the product. - Family/Genus/Species: Juglans. - Also known as: - Disclaimer: Refers to the presence of the allergen in the product, as listed in the regulations specified by an agency and specification or any local market regulations.
label: Walnuts and its derivatives

SWORDFISH
type: Allergen Type Code
Original Code Value: ADU
comment: Refers to the presence of Swordfish and their derivatives in the product, as listed as listed in the regulations specified in AllergenSpecificationAgency and AllergenSpecificationName.
label: Swordfish and its Derivatives
deprecated: ADU

SX
type: Allergen Type Code
Original Code Value: SX
comment: Refers to the presence of pulses in the product. This excludes green beans and green peas, which are considered vegetable crops. Also excluded are crops that are mainly grown for oil extraction. - Family/Genus/Species: Fabaceae. - Also known as: Dry seed legume Crops. - Disclaimer: Refers to the presence of the allergen in the product, as listed in the regulations specified by an agency and specification or any local market regulations.
label: Pulses

TA
type: Allergen Type Code
Original Code Value: TA
comment: Refers to the presence of 3-Aminophenol in the product. - CAS Registry Number: 591-27-5 - Also known as: - Disclaimer: Refers to the presence of the allergen in the product, as listed in the regulations specified by an agency and specification or any local market regulations.
label: 3-Aminophenol

TD
type: Allergen Type Code
Original Code Value: TD
comment: Refers to the presence of Toluene-2,5-diamine in the product. - CAS Registry Number: 95-70-5 - Also known as: Toluene-2,5-diamine - Disclaimer: Refers to the presence of the allergen in the product, as listed in the regulations specified by an agency and specification or any local market regulations.
label: 2,5-Diaminotoluene

TFD
type: Allergen Type Code
Original Code Value: TFD
comment: Refers to the presence of Tilefish and its Derivatives in the product. - Family/Genus/Species: Malacanthidae/(various) - Also known as: Blue Tilefish, Blueline Tilefish, Golden Tilefish, Goldface Tilefish, Ocean Whitefish, Pacific Golden-eyed Tilefish, Pacific Sandperch, Sand Tilefish, Tilefish - Disclaimer: Refers to the presence of the allergen in the product, as listed in the regulations specified by an agency and specification or any local market regulations.
label: Tilefish and its derivatives

TILAPIA
type: Allergen Type Code
Original Code Value: ADV
comment: Refers to the presence of Tilapia and their derivatives in the product, as listed as listed in the regulations specified in AllergenSpecificationAgency and AllergenSpecificationName.
label: Tilapia and its Derivatives
deprecated: ADV

TOLUENE-2,5-DIAMINE
type: Allergen Type Code
Original Code Value: TD
comment: Refers to the presence of Toluene-2,5-diamine as listed in the regulations specified in AllergenSpecificationAgency and AllergenSpecificationName.
label: Toluene-2,5-diamine
deprecated: TD

TR
type: Allergen Type Code
Original Code Value: TR
comment: Refers to the presence of Triticale and its derivatives in the product. - Family/Genus/Species: × Triticosecale. - Also known as: Ryewheat. - Disclaimer: Refers to the presence of the allergen in the product, as listed in the regulations specified by an agency and specification or any local market regulations.
label: Triticale and its derivatives

TREE_NUTS
type: Allergen Type Code
Original Code Value: AN
comment: Refers to the presence of tree nuts and their derivatives in the product, as listed in the regulations specified in AllergenSpecificationAgency and AllergenSpecificationName. Tree nuts can include almonds, hazelnut, walnut, cashews, etc.
label: Tree Nuts and Their Derivatives
deprecated: AN

TREE_NUT_TRACES
type: Allergen Type Code
Original Code Value: TN
comment: Contains Traces of Tree Nuts, i.e. almonds, various kinds of tree nuts.
label: Traces of Tree Nuts
deprecated: AllergenTypeCode-TN

TRITICALE
type: Allergen Type Code
Original Code Value: TR
comment: Refers to the presence of Triticale and their derivatives as listed in the regulations specified in AllergenSpecificationAgency and AllergenSpecificationName.
label: Triticale and Their Derivatives
deprecated: TR

TROUT
type: Allergen Type Code
Original Code Value: ADW
comment: Refers to the presence of Trout and their derivatives in the product, as listed as listed in the regulations specified in AllergenSpecificationAgency and AllergenSpecificationName.
label: Trout and its Derivatives
deprecated: ADW

TTD
type: Allergen Type Code
Original Code Value: TTD
comment: Refers to the presence of Tomato and its derivatives in the product. - Family/Genus/Species: Solanum lycopersicum. - Also known as: - Disclaimer: Refers to the presence of the allergen in the product, as listed in the regulations specified by an agency and specification or any local market regulations.
label: Tomato and its derivatives

TUNA
type: Allergen Type Code
Original Code Value: ABD
comment: Refers to the presence of Tuna and their derivatives in the product, as listed as listed in the regulations specified in AllergenSpecificationAgency and AllergenSpecificationName.
label: Tuna and its Derivatives
deprecated: ABD

TUR
type: Allergen Type Code
Original Code Value: TUR
comment: Refers to the presence of Turbot and its derivates in the product. - Family/Genus/Species: Scophthalmidae/Scophthalmus/S. maximus - Also known as: Brat, Breet, Britt, Butt, Diamond Turbot, Greenland Turbot, Hornyhead Turbot, New Zealand Turbot, Spottail Spiny Turbot, Spotted Turbot, Spring Turbot, Turbot - Disclaimer: Refers to the presence of the allergen in the product, as listed in the regulations specified by an agency and specification or any local market regulations.
label: Turbot and its derivatives

TURBOT
type: Allergen Type Code
Original Code Value: TUR
comment: Refers to the presence of Turbot and its derivatives in the product, as listed in the regulations specified in AllergenSpecificationAgency and AllergenSpecificationName.
label: Turbot and its Derivatives
deprecated: TUR

UM
type: Allergen Type Code
Original Code Value: UM
comment: Refers to the presence of molluscs and its derivates in the product. - Family/Genus/Species: Mollusca (various) - Also known as: (various) - Disclaimer: Refers to the presence of the allergen in the product, as listed in the regulations specified by an agency and specification or any local market regulations.
label: Molluscs and its derivatives

UN
type: Allergen Type Code
Original Code Value: UN
comment: Refers to the presence of Shellfish in the product. Shellfish is a colloquial and fisheries term for exoskeleton-bearing aquatic invertebrates used as food, including various species of molluscs, crustaceans, and echinoderms. - Family/Genus/Species: (various) - Also known as: (various) - Disclaimer: Refers to the presence of the allergen in the product, as listed in the regulations specified by an agency and specification or any local market regulations.
label: Shellfish and its derivatives

UW
type: Allergen Type Code
Original Code Value: UW
comment: Refers to the presence of Wheat and its derivatives in the product. - Family/Genus/Species: Triticum. - Also known as: - Disclaimer: Refers to the presence of the allergen in the product, as listed in the regulations specified by an agency and specification or any local market regulations.
label: Wheat and its derivatives

WALLEYE
type: Allergen Type Code
Original Code Value: ABE
comment: Refers to the presence of Walleye and their derivatives in the product, as listed as listed in the regulations specified in AllergenSpecificationAgency and AllergenSpecificationName.
label: Walleye and its Derivatives
deprecated: ABE

WALNUTS
type: Allergen Type Code
Original Code Value: SW
comment: Refers to the presence of walnut and walnut products as listed in the regulations specified in AllergenSpecificationAgency and AllergenSpecificationName
label: Walnut and Walnut Products
deprecated: SW

WFD
type: Allergen Type Code
Original Code Value: WFD
comment: Refers to the presence of Wolffish and its Derivatives in the product. - Family/Genus/Species: Anarhichadidae/Anarhichas or Anarrhichthys/(various) - Also known as: Atlantic Wolffish, Bering Wolffish, Northern Wolffish, Sea wolves, Spotted Wolffish, Wolffish - Disclaimer: Refers to the presence of the allergen in the product, as listed in the regulations specified by an agency and specification or any local market regulations.
label: Wolffish and its derivatives

WHEAT
type: Allergen Type Code
Original Code Value: UW
comment: Refers to the presence of wheat and their derivatives in the product, as listed in the regulations specified in AllergenSpecificationAgency and AllergenSpecificationName
label: Wheat and Their Derivatives
deprecated: UW

WHELKS
type: Allergen Type Code
Original Code Value: WHK
comment: Refers to the presence of Whelks and its derivatives in the product, as listed in the regulations specified in AllergenSpecificationAgency and AllergenSpecificationName.
label: Whelks and its Derivatives
deprecated: WHK

WHITEFISH
type: Allergen Type Code
Original Code Value: AWF
comment: Refers to the presence of Whitefish and their derivatives in the product, as listed as listed in the regulations specified in AllergenSpecificationAgency and AllergenSpecificationName.
label: Whitefish and its Derivatives
deprecated: AWF

WHITING
type: Allergen Type Code
Original Code Value: WHT
comment: Refers to the presence of Whiting and its derivatives in the product, as listed in the regulations specified in AllergenSpecificationAgency and AllergenSpecificationName.
label: Whiting and its Derivatives
deprecated: WHT

WHK
type: Allergen Type Code
Original Code Value: WHK
comment: Refers to the presence of Whelks and its derivates in the product. - Family/Genus/Species: Buccinidae or Ranellidae or Trochidae/(various) - Also known as: Busycon Whelk, Channeled Whelk, Common Periwinkle, Dog Whelk, Maculated Ivory Whelk, Magpie Whelk, Pear Whelk, Scungili, Veined Rapa Whelk, West Indian Top Shell Whelk, Whelk, Wilk - Disclaimer: Refers to the presence of the allergen in the product, as listed in the regulations specified by an agency and specification or any local market regulations.
label: Whelks and its derivatives

WHT
type: Allergen Type Code
Original Code Value: WHT
comment: Refers to the presence of Whiting and its derivates in the product. - Family/Genus/Species: Gadidae or Sciaenidae or Sillaginidae/(various) - Also known as: Argentine Hake, Blue Whiting, Cape Hake, Carolina Whiting, Chilean Hake, Deep-water Cape Hake, European Hake, European Whiting, Flat Head Sillago, Hoki, Japanese sillago, Japanese Whiting, King George Whiting, King Whiting, Northern Whiting, Pacific Whiting, Sand Whiting, School Whiting, Sea Mullet, Silver Hake, Silver Sillago, Southern Blue Whiting, Southern Hake, Southern Kingcroaker, Southern Kingfish - Disclaimer: Refers to the presence of the allergen in the product, as listed in the regulations specified by an agency and specification or any local market regulations.
label: Whiting and its derivatives

X99
type: Allergen Type Code
Original Code Value: X99
comment: Does not contain declaration obligatory allergens in the product. - Also known as: - Disclaimer: Refers to the absence of allergens in the product, as listed in the regulations specified by an agency and specification or any local market regulations.
label: Does not contain declaration obligatory allergens

YMD
type: Allergen Type Code
Original Code Value: YMD
comment: Refers to the presence of Yam and its derivatives in the product. - Family/Genus/Species: Dioscorea. - Also known as: - Disclaimer: Refers to the presence of the allergen in the product, as listed in the regulations specified by an agency and specification or any local market regulations.
label: Yam and its derivatives

Altitude
type: Measurement type
label: Altitude or Elevation
comment: The height above the surface of a defined geoid, typically the World Geodetic System (WGS 84) geoid for measurements from location sensors using satellite technology (e.g. GPS, Glonass, Galileo) , which approximates to the surface of the earth at sea level. Positive values indicate height above the geoid surface. Negative values indicate depth below the geoid surface. SI Units: metres

AmountOfSubstance
type: Measurement type
label: Amount of substance
comment: The amount of substance that contains a number of atoms, molecules etc. that is equal to the Avogadro constant. SI Units: mole

AmountOfSubstancePerUnitVolume
type: Measurement type
label: Amount of substance per unit volume
comment: The concentration of a solution expressed as the number of moles of dissolved substance per unit volume of solution. SI Units: mole per cubic metre

BELLY
type: Anatomical Form Code
label: Belly

BLOOD
type: Anatomical Form Code
label: Blood

BONE
type: Anatomical Form Code
label: Bone

BRAIN
type: Anatomical Form Code
label: Brain

CARCASS_NONPOULTRY
type: Anatomical Form Code
label: Carcass Nonpoultry

DIAPHRAM
type: Anatomical Form Code
label: Diaphram

ESOPHAGUS
type: Anatomical Form Code
label: Esophagus

FAT
type: Anatomical Form Code
label: Fat

FEET
type: Anatomical Form Code
label: Feet

FOREQUARTER
type: Anatomical Form Code
label: Forequarter

GIZZARD
type: Anatomical Form Code
label: Gizzard

HEAD
type: Anatomical Form Code
label: Head

HEADMEAT_CHEEKMEAT
type: Anatomical Form Code
label: Headmeat Cheekmeat

HEART
type: Anatomical Form Code
label: Heart

HINDQUARTER
type: Anatomical Form Code
label: Hindquarter

HORN
type: Anatomical Form Code
label: Horn

INTESTINE_LARGE
type: Anatomical Form Code
label: Intestine Large

INTESTINE_SMALL
type: Anatomical Form Code
label: Intenstine Small

KIDNEY
type: Anatomical Form Code
label: Kidney

LIPS
type: Anatomical Form Code
label: Lips

LIVER
type: Anatomical Form Code
label: Liver

LUNGS
type: Anatomical Form Code
label: Lungs

MIXED_OFFAL
type: Anatomical Form Code
label: Mixed Offal

MIXED_PARTS_FOR_GROUNDING_MINCING
type: Anatomical Form Code
label: Mixed Parts For Grounding or Mincing

NECK
type: Anatomical Form Code
label: Neck

PANCREAS
type: Anatomical Form Code
label: Pancreas

SKIN
type: Anatomical Form Code
label: Skin

STOMACH
type: Anatomical Form Code
label: Stomach

TAIL
type: Anatomical Form Code
label: Tail

TENDONS
type: Anatomical Form Code
label: Tendons

TESTICLES
type: Anatomical Form Code
label: Testicles

THYMUS
type: Anatomical Form Code
label: Thymus

TONGUE
type: Anatomical Form Code
label: Tongue

TRIPE
type: Anatomical Form Code
label: Tripe

UNCLASSIFIED
type: Anatomical Form Code
label: Unclassified

UNIDENTIFIED
type: Anatomical Form Code
label: Unidentified

WHOLE_BIRD
type: Anatomical Form Code
label: Whole Bird

WHOLE_MUSCLE_NONPOULTRY_MEATPART_PIECE
type: Anatomical Form Code
label: Whole Muscle Nonpoultry Meatpart Piece

WHOLE_MUSCLE_POULTRY_PART
type: Anatomical Form Code
label: Whole Muscle Poultry Part

WHOLE_MUSCLE_PRIMAL
type: Anatomical Form Code
label: Whole Muscle Primal

WHOLE_MUSCLE_RIBCUT
type: Anatomical Form Code
label: Whole Muscle Ribcut

WHOLE_MUSCLE_ROASTCUT
type: Anatomical Form Code
label: Whole Muscle Roast Cut

WHOLE_MUSCLE_SLICE_CHOPCUT
type: Anatomical Form Code
label: Whole Muscle Slice Chopcut

WHOLE_MUSCLE_SLICE_CUTLET
type: Anatomical Form Code
label: Whole Muscle Slice Cutlet

WHOLE_MUSCLE_STEAK_CHOPCUT
type: Anatomical Form Code
label: Whole Muscle Steak Chop-cut

WHOLE_MUSCLE_SUBPRIMAL
type: Anatomical Form Code
label: Whole Muscle Subprimal

Angle
type: Measurement type
comment: The inclination of one line or plane to another. Units: degrees, radians, etc.

AngularAcceleration
type: Measurement type
label: Angular acceleration
comment: The rate of change of angular velocity with respect to time. SI Units: radian per second per second

AngularMomentum
type: Measurement type
label: Angular impulse or Angular momentum
comment: The integral over time of the torque acting on a body that is free to rotate, resulting in a corresponding change in its angular momentum. SI Units: newton metre second, kilogram metre squared per second

AngularVelocity
type: Measurement type
label: Angular velocity
comment: The rate of change of angle with respect to time; a measure of the number of revolutions per unit time. SI Units: radian per second

Area
type: Measurement type
comment: The amount of two-dimensional space occupied, measured in units of length squared. SI Units: square metre

CORPORATION
type: Business Entity Type
label: Corporation
comment: An organization authorized by the state to act as a single entity and recognized as such in law for certain purposes.

FOR_PROFIT
type: Business Entity Type
label: For profit
comment: An organization established, maintained, or conducted for the purpose of making a profit.

GOVERNMENT_AGENCY
type: Business Entity Type
label: Government Agency
comment: A government agency is a permanent or semi-permanent organization within a regional, national or state government. These organizations are responsible for oversight or administration of a specific sector, field, or area of study.

HOLDING_COMPANY
type: Business Entity Type
label: Holding Company
comment: A company created to buy, receive or hold the shares, stock or other assets of other companies, which the holding company typically then controls. A holding company is sometimes referred to as a 'parent' company.

INDIVIDUALLY_OWNED_ENTERPRISE
type: Business Entity Type
label: Individually-Owned Enterprise
comment: Individual ownership of business means that a business is owned by a single person.

JOINT_VENTURE
type: Business Entity Type
label: Joint Venture
comment: A joint venture is a business arrangement in which two or more parties agree to pool their resources for the purpose of accomplishing a specific task. A joint venture can be an informal partnership in the colloquial sense of the word, or it may also take on nearly any other kind of formal legal structure. A key characteristic of joint ventures is that the forming parties share ownership, returns, risk and governance.

LLC
type: Business Entity Type
label: Limited Liability Company
comment: A limited liability company is a form of a private limited company. It is a business structure that can combine the pass-through taxation of a partnership or sole proprietorship with the limited liability of a corporation.

NOT_FOR_PROFIT
type: Business Entity Type
label: Not-for-profit (non profit)
comment: An organization organized and operated for a collective, public or social benefit, in contrast with an entity that operates as a business aiming to generate a profit for its owners. Not-for-profit entities are often formed in order to take advantage of tax-exempt status and other benefits granted by governments to entities that meet the requirements of not-for-profit laws and regulations.

PRIVATE_ENTERPRISE
type: Business Entity Type
label: Private Enterprise
comment: A broad term for businesses that are managed by independent companies or private individuals rather than by the state.

SOE
type: Business Entity Type
label: State-Owned Enterprise
comment: A state-owned enterprise (SOE) is a legal entity that is created or managed by a government in order to partake in commercial activities on the government's behalf. It can be either wholly or partially owned by a government and is typically earmarked to participate in specific commercial activities.

Capacitance
type: Measurement type
comment: The capacitance of an isolated conductor is defined as the ratio of the total charge on it to its electric potential. SI Units: farad

ACTIVE
type: Certification Status Code
label: Active
comment: This certification instance is declared to be in effect for the certified subject.

INACTIVE
type: Certification Status Code
label: Inactive
comment: This certification instance is declared to be no longer in effect.

EXTRA_HARD
type: Cheese Firmness Code
label: Extra Hard

FIRM_SEMIHARD
type: Cheese Firmness Code
label: Firm Semi Hard

HARD
type: Cheese Firmness Code
label: Hard

SOFT
type: Cheese Firmness Code
label: Soft

UNIDENTIFIED
type: Cheese Firmness Code
label: Unidentified

BUYER
type: Colour Code List Code
Original Code Value: 6
comment: Assigned by buyer.
label: Assigned by Buyer

IFPS
type: Colour Code List Code
Original Code Value: 11
comment: International Federation for Produce Standards.
label: International Federation for Produce Standards

NCS
type: Colour Code List Code
Original Code Value: 10
comment: Natural Colour System.
label: Natural Colour System

NRF
type: Colour Code List Code
Original Code Value: 1
comment: National Retail Federation.
label: National Retail Federation.

PANTONE_HEXACHROME
type: Colour Code List Code
Original Code Value: 4
comment: Pantone Hexachrome.
label: Pantone Hexachrome

PANTONE_MATCHING
type: Colour Code List Code
Original Code Value: 2
comment: Pantone Matching System.
label: Pantone Matching System

PANTONE_PROCESS_COLOUR
type: Colour Code List Code
Original Code Value: 3
comment: Pantone Process Colour System.
label: Pantone Process Colour System

PANTONE_TEXTILE
type: Colour Code List Code
Original Code Value: 5
comment: Pantone Textile. Same as GS1 ColourCodeList Code 5
label: Pantone Textile

RAL
type: Colour Code List Code
Original Code Value: 9
comment: Farbsystem RAL Colour System.
label: Farbsystem RAL Colour System

SELLER
type: Colour Code List Code
Original Code Value: 7
comment: Assigned by seller.
label: Assigned by Seller

WWS
type: Colour Code List Code
Original Code Value: 8
comment: Waren Wirtschafts System.
label: Waren Wirtschafts System

CAFFEINE
type: Compulsory Additional Label Information Type Code
label: Caffeine
comment: The declaration of the cautionary statements related to caffeine. Caffeine is a central nervous system stimulant of the methylxanthine class.

MEAT_POULTRY_WATER_RETENTION
type: Compulsory Additional Label Information Type Code
label: Meat poultry water retention
comment: The declaration of the amount of water added and retained in a raw single-ingredient meat product due to evisceration contact with water, in excess of naturally occurring moisture.

PREBIOTIC
type: Compulsory Additional Label Information Type Code
label: Prebiotic
comment: The declaration of the specific and measurable health benefit conferred by the prebiotic substance. Prebiotics are foods (typically high-fiber foods) that act as food for human microflora. Prebiotics are used with the intention of improving the balance of these microorganisms.

PROBIOTICS
type: Compulsory Additional Label Information Type Code
label: Probiotics
comment: The declaration of probiotic health claims and the composition of probiotic microorganisms.

SUPPLEMENTED_FOODS_CAUTION
type: Compulsory Additional Label Information Type Code
label: Supplemented foods caution
comment: The declaration of supplemented food product contains cautionary statement that the supplemented food may pose a risk to consumers.

SWEETENERS
type: Compulsory Additional Label Information Type Code
label: Sweeteners
comment: The declaration of additive sweeteners that are used to impart sweet taste to food.

Conductance
type: Measurement type
comment: The ratio of the current in the conductor to the potential difference between its ends; reciprocal of resistance. SI Units: siemen

Conductivity
type: Measurement type
comment: A measure of how strongly a material conducts electric current. The ratio of the current density to the electric field that causes the current to flow. SI Units: siemen per metre

ADULT
type: Consumer Lifestage Code
label: Suitable for Adults

ALL_AGES
type: Consumer Lifestage Code
label: Suitable for All Ages

BABY_INFANT
type: Consumer Lifestage Code
label: Suitable for Babies/Infants

CHILD_1_To_2_YEARS
type: Consumer Lifestage Code
label: Suitable for Children One to Two Years Old

CHILD_2_YEARS_ONWARDS
type: Consumer Lifestage Code
label: Suitable for Children 2 Plus Years of Age

UNCLASSIFIED
type: Consumer Lifestage Code
label: Unclassified

UNIDENTIFIED
type: Consumer Lifestage Code
label: Unidentified

BTC
type: Consumer Sales Conditions Code
comment: Products that are sold without a prescription but must be distributed through a pharmacy.
label: Behind the Counter

OTC
type: Consumer Sales Conditions Code
comment: Products that may be sold without a prescription. These products are generally available without restrictions.
label: Over the Counter

PRESCRIPTION_REQUIRED
type: Consumer Sales Conditions Code
comment: Product may only be sold or dispensed under the direction of a prescription.
label: Prescription Required

RESTRICTED_TO_SELL_16
type: Consumer Sales Conditions Code
comment: Based upon legal regulatory restrictions it is illegal to sell the product to anyone under the age of 16 years old.
label: Restricted To Sell 16

RESTRICTED_TO_SELL_18
type: Consumer Sales Conditions Code
comment: Based upon legal regulatory restrictions it is illegal to sell the product to anyone under the age of 18 years old.
label: Restricted To Sell 18

RESTRICTED_TO_SELL_21
type: Consumer Sales Conditions Code
comment: Based upon legal regulatory restrictions it is illegal to sell the product to anyone under the age of 21 years old.
label: Restricted To Sell 21

ACCOUNTING_CONTACT
type: Contact Role Type
label: Accounting Contact
comment: The contact responsible for accounting matters.
term status: stable

ACCOUNTS_PAYABLE_CONTACT
type: Contact Role Type
label: Accounts Payable Contact
comment: Department/person responsible for the accounts payable function within a corporation.
term status: stable

ACCOUNTS_RECEIVABLE_CONTACT
type: Contact Role Type
label: Accounts Receivable Contact
comment: Department/person responsible for the accounts receivable within a corporation.
term status: stable

ADMINISTRATIVE_CONTACT
type: Contact Role Type
label: Administrative Contact
comment: Department/person to contact for matters regarding administrative matters.
term status: stable

AFTER_BUSINESS_HOURS_CONTACT
type: Contact Role Type
label: After Business Hours Contact
comment: Department/person to contact after normal working hours.
term status: stable

AGENT_CONTACT
type: Contact Role Type
label: Agent Contact
comment: The person or organisation who is authorised to act on behalf of one or more parties to sell the product or services. For example, a wine broker.
term status: stable

BANKING_CONTACT
type: Contact Role Type
label: Banking Contact
comment: Contact person for bank.
term status: stable

CLAIMS_CONTACT
type: Contact Role Type
label: Claims Contact
comment: Department/person to contact for matters regarding claims.
term status: stable

CONSUMER_SUPPORT_CONTACT
type: Contact Role Type
label: Consumer Support Contact
comment: The organisation/party which provides product support to the end user of a trade item or a service.
term status: stable

CONTRACT_CONTACT
type: Contact Role Type
label: Contract Contact
comment: Department/person to contact for matters regarding contracts.
term status: stable

COOK
type: Contact Role Type
label: Cook
comment: Department/person responsible for cooking.
term status: stable

CUSTOMER_RELATIONS
type: Contact Role Type
label: Customer Relations
comment: Individual responsible for customer relations.
term status: stable

CUSTOMER_SUPPORT_CONTACT
type: Contact Role Type
label: Customer Support Contact
comment: The organisation/party which provides product support to the trading partner party to which merchandise is sold.
term status: stable

DANGEROUS_GOODS_CONTACT
type: Contact Role Type
label: Dangerous Goods Contact
comment: Department/person to be contacted for details about the transportation of dangerous goods/hazardous material.
term status: stable

DELIVERY_CONTACT
type: Contact Role Type
label: Delivery Contact
comment: Department/person responsible for delivery.
term status: stable

DEPARTMENT/EMPLOYEE_TO_EXECUTE_EXPORT_PROCEDURES
type: Contact Role Type
label: Department/Employee to Execute Export Procedures
comment: Department/employee which/who executes export procedures.
term status: stable

DEPARTMENT/EMPLOYEE_TO_EXECUTE_IMPORT_PROCEDURES
type: Contact Role Type
label: Department/Employee to Execute Import Procedures
comment: Department/employee which/who executes import procedures.
term status: stable

DEPARTMENT_OR_PERSON_RESPONSIBLE_FOR_PROCESSING_PURCHASE_ORDER
type: Contact Role Type
label: Department Or Person Responsible for Processing Purchase Order
comment: Identification of the department or person responsible for the processing of purchase orders.
term status: stable

DISTRIBUTOR
type: Contact Role Type
label: Distributor
comment: Distributor: A person, firm, etc., engaged in the general distribution or marketing of some article or class of goods.
term status: stable

EMERGENCY_DANGEROUS_GOODS_CONTACT
type: Contact Role Type
label: Emergency Dangerous Goods Contact
comment: Organisation/party who is to be contacted to intervene in case of emergency.
term status: stable

ENGINEERING_CONTACT
type: Contact Role Type
label: Engineering Contact
comment: Department/person to contact for matters regarding engineering.
term status: stable

FINANCIAL_CONTACT
type: Contact Role Type
label: Financial Contact
comment: Department/person to contact for matters regarding financial matters.
term status: stable

GDS_CONTACT
type: Contact Role Type
label: GDS Contact
comment: The contact where information in relation to Data Synchronisation can be obtained.
term status: stable

GOODS_RECEIVING_CONTACT
type: Contact Role Type
label: Goods Receiving Contact
comment: Department/person responsible for receiving the goods at the place of delivery.
term status: stable

INFORMATION_CONTACT
type: Contact Role Type
label: Information Contact
comment: Department/person to contact for questions regarding transactions.
term status: stable

INSURANCE_CONTACT
type: Contact Role Type
label: Insurance Contact
comment: Department/person to contact for matters regarding insurance.
term status: stable

LICENSEE_REGISTRAR
type: Contact Role Type
label: Licensee Registrar Contact
comment: The organisation/party having legal responsibility for the product in the target market. This organisation/party is responsible for licensing and regulations within the target market and can be the manufacturer, importer, sales agent or broker.
term status: stable

LOGISTICS_CONTACT
type: Contact Role Type
label: Logistics Contact
comment: Department/person to contact for matters regarding logistics.
term status: stable

MANAGER_CONTACT
type: Contact Role Type
label: Manager Contact
comment: Person responsible for management within a department or company.
term status: stable

NOTIFICATION_CONTACT
type: Contact Role Type
label: Notification Contact
comment: Department/employee to be notified.
term status: stable

OPERATIONS_CONTACT
type: Contact Role Type
label: Operations Contact
comment: Department/person to contact for matters regarding operations.
term status: stable

ORDER_CONTACT
type: Contact Role Type
label: Order Contact
comment: An individual to contact for questions regarding this order.
term status: stable

PACKAGING_ENGINEER_CONTACT
type: Contact Role Type
label: Packaging Engineer
comment: The contact where information in relation to the packaging for the item can be obtained.
term status: stable

PLACE_OF_COLLECTION_CONTACT
type: Contact Role Type
label: Place Of Collection Contact
comment: Department/employee to be contacted at the place of collection.
term status: stable

PRODUCT_MANAGEMENT_CONTACT
type: Contact Role Type
label: Product Management Contact
comment: Department/person to contact for questions regarding this order.
term status: stable

PRODUCT_RECALL_CONSUMER_CONTACT
type: Contact Role Type
label: Product Recall Consumer Contact
comment: Contact who is responsible for providing information related to the product recall to consumers.
term status: stable

PRODUCT_RECALL_MEDIA_CONTACT
type: Contact Role Type
label: Product Recall Media Contact
comment: Contact who is responsible for providing information related to the product recall to media outlets.
term status: stable

PRODUCT_RECALL_NOTIFICATION_CONTACT
type: Contact Role Type
label: Product Recall Notification Contact
comment: Contact responsible for creating, issuing and updating the product recall notification.
term status: stable

PRODUCT_RECALL_REMOVAL_CONTACT
type: Contact Role Type
label: Product Recall Removal Contact
comment: Contact responsible for creating and issuing the product removal message to the product recall contact.
term status: stable

PURCHASING_CONTACT
type: Contact Role Type
label: Purchasing Contact
comment: Department/person responsible for issuing this purchase order.
term status: stable

QUALITY_COORDINATOR_CONTACT
type: Contact Role Type
label: Quality Coordinator Contact
comment: Quality coordinator contact within an organization.
term status: stable

RECALL_SUPPORT_CONTACT
type: Contact Role Type
label: Recall Support Contact
comment: The contact where information about recalls for the item can be obtained.
term status: stable

RESPONSIBLE_PERSON_FOR_COMPUTER_DATA_PROCESSING
type: Contact Role Type
label: Responsible Person For Computer Data Processing
comment: Responsible person to contact for matters regarding computer data processing.
term status: stable

RETURN_AUTHORITY_CONTACT
type: Contact Role Type
label: Return Authority Contact
comment: Person/Department responsible for goods return transaction.
term status: stable

SALES_ADMINISTRATION
type: Contact Role Type
label: Sales Administration
comment: Name of the sales administration contact within a corporation.
term status: stable

SALES_REPRESENTATIVE_OR_DEPARTMENT_CONTACT
type: Contact Role Type
label: Sales Representative or Department Contact
comment: The sales representative or department contact within an organization.
term status: stable

SHIPPING_CONTACT
type: Contact Role Type
label: Shipping Contact
comment: The shipping department contact within an organization.
term status: stable

TARGET_MARKET_INFORMATION_PROVIDER
type: Contact Role Type
label: Target Market Information Provider
comment: The contact information provider's business contact within the target market for the GTIN. This is a different GLN than the Information Provider of the item of record.
term status: stable

TECHNICAL_SUPPORT
type: Contact Role Type
label: Technical Support
comment: Department/person to contact for technical help and advice about products, services or other concerns.
term status: stable

TEST_CONTACT
type: Contact Role Type
label: Test Contact
comment: Department/person responsible for testing contact.
term status: stable

TRAFFIC_ADMINISTRATOR
type: Contact Role Type
label: Traffic Administrator Contact
comment: The traffic administrator contact within an organization.
term status: stable

TRANSPORT_CONTACT
type: Contact Role Type
label: Transport Contact
comment: Department/person in charge of transportation.
term status: stable

WARRANTY_CONTACT
type: Contact Role Type
label: Warranty Contact
comment: Person/Department responsible for warranty resolution.
term status: stable

Count
type: Measurement type
comment: A measure of the total quantity of something; the number of individual units present. Typically dimensionless (no units)

Density
type: Measurement type
comment: The mass per unit volume of a substance. SI Units: kilogram per cubic metre

COELIAC
type: Diet Type Code
comment: Denotes a product that can be safely consumed by a person with coeliac disease. Coeliac disease is caused by a reaction to gladin (a gluten protein found in wheat) and similar proteins found in other crops.
label: Coeliac

DIETETIC
type: Diet Type Code
comment: Denotes a product that is specially prepared or processed for people on restrictive diets.
label: Dietetic

FREE_FROM_GLUTEN
type: Diet Type Code
comment: Denotes a product that can be used in a gluten free diet, as specified by the appropriate authority within a target market.
label: Free From Gluten

HALAL
type: Diet Type Code
comment: Denotes selling or serving food ritually fit according to Islamic dietary laws.
label: Halal

KOSHER
type: Diet Type Code
comment: Denotes selling or serving food ritually fit according to Jewish dietary laws.
label: Kosher

ORGANIC
type: Diet Type Code
comment: Denotes a food product that was produced with the use of feed or fertiliser of plant or animal origin, without employment of chemically formulated fertilisers, growth stimulants, antibiotics or pesticides.
label: Organic

VEGAN
type: Diet Type Code
comment: Denotes a food product which contains no animal food or dairy products.
label: Vegan

VEGETARIAN
type: Diet Type Code
comment: Denotes a product that contains no meat, fish or other animal products.
label: Vegetarian

WITHOUT_BEEF
type: Diet Type Code
comment: Denotes a product that contains no beef or beef-products. Beef is considered to be a taboo food product by some religions most notable Hinduism, Buddhism and Jainism.
label: Without Beef

WITHOUT_PORK
type: Diet Type Code
comment: Denotes a product that contains no pork meat.
label: Without Pork

Dimensionless
type: Measurement type
comment: A measurement whose units are dimensionless. gs1:Count or gs1:VolumeFraction or gs1:RelativeHumidity should be used in preference if appropriate.

BOGO
type: Discount Type Code
comment: Buy one item and get the second item free of charge

DISCOUNTED_ITEM
type: Discount Type Code
comment: A discount on the item expressed as an amount (value and currency)
label: Discounted Item

FREE_GIFT
type: Discount Type Code
comment: A gift given to a consumer as part of a promotional contingent on the consumer making a purchase of another item or items.
label: Free Gift

FREE_SHIPPING
type: Discount Type Code
comment: No charge for shipping.
label: Free Shipping

OTHER
type: Discount Type Code
comment: A discount other than the ones on this list.
label: Other

PERCENTAGE_OFF
type: Discount Type Code
comment: A percentage off the product price.
label: Percentage Off

DoseEquivalent
type: Measurement type
label: Dose Equivalent
comment: The product of the absorbed dose multiplied by a Q factor (relating to the type of radiation) and a factor relating to all relevant aspects of the body being irradiated, multiplied by the exposure time. SI Units: sievert

DoseEquivalentRate
type: Measurement type
label: Dose equivalent rate
comment: The product of the absorbed dose rate multiplied by a Q factor (relating to the type of radiation) and a factor relating to all relevant aspects of the body being irradiated. SI Units: sievert per second

DynamicViscosity
type: Measurement type
label: Dynamic viscosity
comment: The value of the tangential force per unit area which is necessary to maintain unit relative velocty between two parallel planes unit distance apart in a fluid. SI Units: pascal

ERROR_CONDITION
type: Sensor Alert Type
label: Error condition
comment: Indicates the reporting of an error condition detected by a sensor device

ElectricCharge
type: Measurement type
label: Electric Charge
comment: Quantity of unbalanced electricity in an object, i.e. excess or deficiency of electrons, resulting in negative or positive electrification, respectively. SI Units: coulomb

ElectricCurrent
type: Measurement type
label: Electric Current
comment: Rate of flow of charge in a substance, whether solid, liquid or gas. SI Units: ampere

ElectricCurrentDensity
type: Measurement type
label: Electric current density
comment: Rate of flow of charge in a substance per unit area perpendicular to the current. SI Units: ampere per square metre

ElectricFieldStrength
type: Measurement type
label: Electric field strength
comment: The electric force acting on a unit charge. The linear gradient of the electrostatic potential. SI Units: volt per metre = newton / coulomb

Energy
type: Measurement type
comment: A measure of a the capacity of a system or body to do work. SI Units: joule

Exposure
type: Measurement type
comment: The product of light intensity and time duration of the exposure. SI Units: lux second

CAN_BE_REFRIGERATED
type: Food Beverage Refrigeration Claim Code
label: Can Be Refrigerated.

MUST_BE_REFRIGERATED
type: Food Beverage Refrigeration Claim Code
label: Must Be Refrigerated.

SHELF_STABLE
type: Food Beverage Refrigeration Claim Code
label: Shelf Stable.

UNIDENTIFIED
type: Food Beverage Refrigeration Claim Code
label: Unidentified.

ANY_MEAL
type: Food Beverage Target Use Code
label: Any Meal

BREAKFAST
type: Food Beverage Target Use Code
label: Breakfast

MAIN_MEAL
type: Food Beverage Target Use Code
label: Main Meal

PORTABLE_MEAL
type: Food Beverage Target Use Code
label: Portable Meal

SNACK
type: Food Beverage Target Use Code
label: Snack

UNCLASSIFIED
type: Food Beverage Target Use Code
label: Unclassified

MULTIPLE_FASTENING
type: Footwear Fastening Type Code
label: Multiple Fastenings

SHOE_LACE
type: Footwear Fastening Type Code
label: Shoe Lace

SLIP_ON_WITHOUT_ELASTIC
type: Footwear Fastening Type Code
label: Slip On Without Elastic

SLIP_ON_WITH_ELASTIC
type: Footwear Fastening Type Code
label: Slip On With Elastic

STRAP
type: Footwear Fastening Type Code
label: Strap

UNCLASSIFIED
type: Footwear Fastening Type Code
label: Unclassified

UNIDENTIFIED
type: Footwear Fastening Type Code
label: Unidentified

VELCRO
type: Footwear Fastening Type Code
label: Velcro

Force
type: Measurement type
comment: The rate of change of linear momentum of a body on which a force acts. A force acting on a body which is free to move produces an acceleration in the motion of the body. SI Units: newton

Frequency
type: Measurement type
comment: The rate of repetition of a periodic oscillation or disturbance; the number of cycles per unit time. SI Units: hertz

FRESHWATER_FARMED
type: Fresh Or Seawater Farmed Code
label: Freshwater Farmed

SEAWATER_FARMED
type: Fresh Or Seawater Farmed Code
label: Seawater Farmed

UNCLASSIFIED
type: Fresh Or Seawater Farmed Code
label: Unclassified

UNIDENTIFIED
type: Fresh Or Seawater Farmed Code
label: Unidentified

DIGITAL_LOCATION
type: GLN Type Code
comment: An electronic (non-physical) address that is used for communication between computer systems.
label: Digital Location

FIXED_PHYSICAL_LOCATION
type: GLN Type Code
comment: Fixed physical location - a tangible place that does not change locations and may be represented by an address, coordinates, or other means.
label: Fixed Physical Location

FUNCTION
type: GLN Type Code
comment: An organisational subdivision or department.
label: Function

LEGAL_ENTITY
type: GLN Type Code
comment: Any business, government body, department, charity, individual, or institution that has standing in the eyes of the law and has the capacity to enter into agreements or contracts.
label: Legal Entity

MOBILE_PHYSICAL_LOCATION
type: GLN Type Code
comment: Mobile physical location - a tangible place that is expected to change locations and may be represented by an address, coordinates, or other means.
label: Mobile Physical Location

CAGE_FREE
type: Growing Method Code
comment: Animal is not confined to a cage.
label: Cage Free

CLONED_FOODS
type: Growing Method Code
comment: Product is a result of genetic engineering.
label: Cloned Food

CONVENTIONAL
type: Growing Method Code
comment: Foods grown non-organically, either indoors or outdoors without any special processes.
label: Conventional

FARM_RAISED
type: Growing Method Code
comment: Animal is raised on a farm.
label: Farm Raised

FIELD_GROWN
type: Growing Method Code
comment: Plants Grown Outdoors
label: Field Grown

FLY_FREE
type: Growing Method Code
comment: Citrus Grown in an area certified to be free of all Caribbean Fruit Flies based on trappings
label: Fly Free

FREE_RANGE
type: Growing Method Code
comment: A method that animals are allowed to roam with little restriction to their movements.
label: Free Range

GRASS_FED
type: Growing Method Code
comment: Animal is predominately fed grass or forage.
label: Grass Fed

GREENHOUSE
type: Growing Method Code
comment: Plants that are grown and cultivated in an indoor covered place.
label: Greenhouse

HUMANELY_RAISED
type: Growing Method Code
comment: A process where animals are raised such that the welfare of the animal is a foremost concern.
label: Humanely Raised

HYDROPONIC
type: Growing Method Code
comment: Plants grown using mineral nutrient solutions instead of soil.
label: Hydroponic

INTEGRATED_PEST_MANAGEMENT
type: Growing Method Code
comment: (IPM) Plants grown using a pest control strategy that uses an array of complimentary methods: mechanical devices, physical devices, genetic, biological, legal, cultural management and chemical management. These methods are done in three stages: prevention, observation, and intervention. It is an ecological approach with a main goal of significantly reducing or eliminating the use of pesticides.
label: Integrated Pest Management

ORGANIC
type: Growing Method Code
comment: Foods grown organically, either indoors or outdoors.
label: Organic

SHADE_GROWN
type: Growing Method Code
comment: Produce which has been grown under shade or grown under cloth.
label: Shade Grown

SUSTAINABLE
type: Growing Method Code
comemnt: A method of growing a resource so that the resource is not depleted or permanently damaged
label: Sustainable

WILD
type: Growing Method Code
comment: The animal or plant was not inhibited or prohibited from roving, wandering, and not tamed or domesticated.
label: Wild

Illuminance
type: Measurement type
comment: The energy in the form of visible radiation reaching a surface per unit area in unit time; the amount of luminous flux per unit area. SI Units: lux = 1 lumen per square metre

Inductance
type: Measurement type
comment: The magnitude of the property of an element or circuit to form a magnetic field and store magnetic energy when carrying a current. The property of an electric circuit or component that causes an electromotive force to be generated in it as a result of a change in the current flowing through the circuit (self inductance) or of a change in the current flowing through a neighbouring circuit with which it is magnetically linked (mutual inductance). SI Units: henry

Irradiance
type: Measurement type
comment: The flux of radiant energy per unit area, especially an area perpendicular to the direction of travel through a medium. A measure of the radiant power per unit area that flows across a surface. SI Units: watt per square metre

KinematicViscosity
type: Measurement type
label: Kinematic viscosity
comment: The ratio of the viscosity of a liquid to its density. SI Units: square metres per second

Length
type: Measurement type
comment: The linear magnitude of any thing, as measured end to end. Length, width, depth, height, diameter are all measured in units of length. SI Units: metre

CONTAINS
type: Level Of Containment Code
comment: Intentionally included in the product.
label: Contains

FREE_FROM
type: Level Of Containment Code
comment: The product is free from the indicated substance.
label: Free From

MAY_CONTAIN
type: Level Of Containment Code
comment: The substance is not intentionally included, but due to shared production facilities or other reasons, the product may contain the substance.
label: May Contain

LinearMomentum
type: Measurement type
label: Impulse or linear momentum
comment: The impulse is the integral over time of the force acting between two colliding bodies. Linear momentum of a body is the product of its mass and its velocity. SI Units: newton seconds

BIC_FACILITY
type: Location ID Type
comment: The BIC Facility Code (BFC) began life in the 1980s as the 'LoCode' identifier under ISO 9897. Now a 'child code' of the UN/Locode, the BIC Facility Code is used to identify container facilities such as depots, container yards, container freight stations, M&R vendors and other facilities in the container supply chain. The BIC Facility Code is complementary to the SMDG Ocean Terminal Code, which is also a child code of the UN/Locode. The BIC Facility Code covers container facility types other than ocean terminals.
label: BIC Facility Code (BFC)

CRD_LOCATION_CODE
type: Location ID Type
comment: The Central Reference File Database (CRD) (formerly known as Central Repository Domain) is a centralised database that stores Location Codes and Company Codes required by European regulation, and makes them available to users. CRD contains the following reference files: - List of Countries (ISO 3166) - The Location Reference File which uniquely identifies physical rail points (e.g. stations, customer sidings, loading places) containing the Location Code (which includes the Country Code) - The Partner Reference File uniquely identifies all rail actors who exchange information (Company Codes); Each company actor must have a unique Company Code assigned by UIC
label: Central Reference File Database (CRD) covers both Locations and Organisations. The Location Reference File uniquely identifies physical rail points (e.g. stations, customer sidings, loading places)

ENI_NUMBER
type: Location ID Type
comment: An ENI number (European Number of Identification or European Vessel Identification Number) is a registration for ships capable of navigating on inland European waters. It is a unique, eight-digit identifier that is attached to a hull for its entire lifetime, independent of the vessel's current name or flag. ENI was introduced by the Inland Transport Committee of the United Nations Economic Commission for Europe in their meeting on 11-13 October 2006 in Geneva. It is based on the Rhine Vessel certification system previously used for ships navigating the Rhine, and is comparable to the IMO ship identification number.
label: An ENI number (European Number of Identification or European Vessel Identification Number).

FR_SIRET
type: Location ID Type
comment: The SIRET number, issued by Insee (the National Institute of Statistics and Economic Studies) identifies each establishment that is part of a company in France. There are as many SIRET numbers as there are establishments in the company. An establishment is a geographically located operating or production unit, separated but legally dependent on a company. It is the place where the company's activity is carried out. It is composed of 14 digits: the 9 digits of the SIREN number + the 5 digits of the NIC (internal classification number specific to each establishment).
label: Système d'identification du répertoire des établissements

IATA_CODE
type: Location ID Type
comment: Three-letter geocode designating many airports and metropolitan areas around the world, defined by the International Air Transport Association (IATA). The IATA three-letter codes are a subset of the UN/LOCODE codelist.
label: International Air Transport Association (IATA) code

IMO_NUMBER
type: Location ID Type
comment: IMO number is an important identifier given to oil/gas vessels, shipping vessels, and fishing vessels that is painted visibly across the vessel and bolted to the hull
label: International Maritime Organization Number

ISPS_CODE
type: Location ID Type
comment: The International Ship and Port Facility Security Code (ISPS Code) is an International code that was conceived following the September 11th 2001 terrorists attacks in the USA. Its primary purpose is to identify and counter any terrorist threat to the Maritime Industry particularly against ships and ports. The code also serves to improve security against armed robbery, theft and piracy. The code came into force in 2004 and prescribes responsibilities to: 1) Governments 2) Shipping companies 3) Shipboard personnel 4) Port/facility personnel
label: International Ship and Port Facility Security Code (ISPS Code)

ISRS_LOCATION_CODE
type: Location ID Type
comment: The International Ship Reporting Standard (ISRS) location code is a 20 character alphanumeric code consisting of: - UN country code (2 characters) e.g., NL = Netherlands, - UN location code (3 characters) e.g., RTM = Rotterdam, - Fairway section code (5 characters) e.g., 00102 = Nieuwe Maas, - Object reference code (5 characters) e.g., 66666 = ID administration or terminal code, - Fairway section hectometre e.g., 00050 = hectometres from zero point of Fairway section 00102. The ISRS Location Code is created once and shall not be changed throughout the lifetime of the object. The Standard / Commission Regulation for Electronic Ship Reporting requires the ISRS Location Code of all objects relevant for reporting of voyages, e.g. ports, terminals, passage points, etc.
label: International Ship Reporting Standard or ISRS location code

LOCATION_FOR_INTERNAL_USE_1
type: Location ID Type
comment: Identification used for internal mapping purposes.
label: Location For Internal Use 1

LOCATION_FOR_INTERNAL_USE_10
type: Location ID Type
comment: Identification used for internal mapping purposes.
label: Location For Internal Use 10

LOCATION_FOR_INTERNAL_USE_2
type: Location ID Type
comment: Identification used for internal mapping purposes.
label: Location For Internal Use 2

LOCATION_FOR_INTERNAL_USE_3
type: Location ID Type
comment: Identification used for internal mapping purposes.
label: Location For Internal Use 3

LOCATION_FOR_INTERNAL_USE_4
type: Location ID Type
comment: Identification used for internal mapping purposes.
label: Location For Internal Use 4

LOCATION_FOR_INTERNAL_USE_5
type: Location ID Type
comment: Identification used for internal mapping purposes.
label: Location For Internal Use 5

LOCATION_FOR_INTERNAL_USE_6
type: Location ID Type
comment: Identification used for internal mapping purposes.
label: Location For Internal Use 6

LOCATION_FOR_INTERNAL_USE_7
type: Location ID Type
comment: Identification used for internal mapping purposes.
label: Location For Internal Use 7

LOCATION_FOR_INTERNAL_USE_8
type: Location ID Type
comment: Identification used for internal mapping purposes.
label: Location For Internal Use 8

LOCATION_FOR_INTERNAL_USE_9
type: Location ID Type
comment: Identification used for internal mapping purposes.
label: Location For Internal Use 9

MMSI_NUMBER
type: Location ID Type
comment: Maritime Mobile Service Identities (MMSIs) are nine-digit numbers used by maritime digital selective calling (DSC), automatic identification systems (AIS), and certain other equipment to uniquely identify a ship or a coast radio station.
label: Maritime Mobile Service Identity number

OAR_ID
type: Location ID Type
comment: Open Apparel Registry ID. A sixteen-digit numbering system which uniquely identities global apparel facilities. The ID consists of a Country code, Origin date (the date the facility first appeared in the registry), a General ID and Check ID. OAR IDs are allocated by the Open Apparel Registry to all facilities contributed to the database for the purposes of enabling industry collaboration and improved identification of factories, as well as powering interoperability between industry databases.
label: Open Apparel Registry ID
deprecated: OS_ID

OPEN_LOCATION_CODE
type: Location ID Type
comment: The Open Location Code is a geocode system for identifying an area anywhere on the Earth. It was developed at Google's Zürich engineering office, and released late October 2014. Location codes created by the OLC system are referred to as 'plus codes'.
label: Open Location Code

OS_ID
type: Location ID Type
comment: Open Supply Hub (OSH) is an expansion of Open Apparel Registry. An OS ID is a fifteen-character numbering system which uniquely identifies global production locations. The ID consists of a Country code, Origin date (the date the facility first appeared in the hubregistry), a General ID and Check ID. Open Supply Hub IDs are allocated by the Open Supply Hub to all production locations that contribute to the database for the purposes of enabling industry collaboration and improved identification of production points, as well as powering interoperability between industry databases.
label: Open Supply Hub ID

SMDG_CODE
type: Location ID Type
comment: The SMDG Terminal Code List (TCL) contains codes for container handling terminal facilities that are called by seagoing cargo vessels in maritime transport.
label: SMDG Container terminal code

UN_LOCODE
type: Location ID Type
comment: UN/LOCODE, the United Nations Code for Trade and Transport Locations, is a geographic coding scheme developed and maintained by United Nations Economic Commission for Europe.
label: UN/LOCODE

US_CIF_CODE
type: Location ID Type
comment: The Customer Identification File (CIF) is an industry reference file (for the USA), managed by Railinc, that contains the name, physical mailing and billing address, corporate parent information and a unique 13-character identification code for each location and sub-location of a transportation-carrier customer. Railroads use the identification code to accurately identify customers and their locations, ensuring each party in the transaction is referencing the same physical customer location.
label: Customer Identification File (CIF) for RAIL

US_EST_NUMBER
type: Location ID Type
comment: All containers of meat, poultry, and egg products must be labeled with a USDA mark of inspection and establishment (EST number), which is assigned to the plant where the product was produced.
label: USDA Establishment Number

US_FEI
type: Location ID Type
comment: An FDA Establishment Identification (FEI) number is a unique identifier issued by FDA to track inspections of the regulated establishment or facility. FEI numbers are also used to track GDUFA facility fee payments.
label: FDA Establishment Identifier (Facility FEI)

US_HIN_IDENTIFICATION
type: Location ID Type
comment: The HIN is a unique combination of letters and/or numbers permanently affixed to the vessel. All boats must be registered with the USCG (United States Coast Guard ) in order to track accidents and history of boats. Information about a boat's records may be found by using a vessel documentation search by Hull ID Number (HIN).
label: Hull Identification Number

US_MINE_ID
type: Location ID Type
comment: All mines are required to apply for an MSHA mine identification number. An MSHA ID is required for each mine site and must be issued before any operations may begin. A mine ID may be requested by completing the online form or by contacting U.S. district office.
label: U.S. Mine ID

US_TCN_CODE
type: Location ID Type
comment: The Terminal Control Locations Directory lists all approved terminals registered as part of the taxable fuel bulk delivery system. Terminals are listed by the terminal number.
label: Terminal Control Number (TCN) / Terminal Locations Directory. USA - IRS.

AGED_CARE_SERVICE
type: Location Role Code
comment: Service or facility providing aged care.
label: Aged Care Service
term status: unstable

AIRCRAFT
type: Location Role Code
comment: A vehicle or machine that is able to fly by gaining support from the air.
label: Aircraft
term status: unstable

AIRPORT
type: Location Role Code
comment: A location with airfield and terminal facilities for aircraft take-off and landing, serving as an air transport terminal at which aircraft may call to receive services such as loading and discharging passengers, crews or cargo, refuelling, restocking, repair etc.
label: Airport
term status: stable

AIRPORT_GATE
type: Location Role Code
comment: Entrance to a movable passage like a tunnel or bridge leading to the aircraft
label: Airport Gate
term status: unstable

AMBULANCE_SERVICE
type: Location Role Code
comment: Provides initial patient care and transportation to a medical facility
label: Ambulance Service
term status: unstable

AMUSEMENT_ENTERTAINMENT_GAMING
type: Location Role Code
comment: Provides recreation and entertainment services
label: Amusement Entertainment Gaming
term status: unstable

ASSEMBLY
type: Location Role Code
comment: An area where components are put together into an end product, appropriate to the process concerned.
label: Assembly
term status: unstable

ATM
type: Location Role Code
comment: An automated teller machine (ATM) is an electronic banking outlet that allows customers to complete basic transactions without the aid of a branch representative or teller. ATMs are known in different parts of the world as automated bank machines (ABM) or cash machines.
term status: unstable

BACKROOM
type: Location Role Code
comment: An area within a store (all formats - club, etc.) used to hold product until it is purchased or can be moved to the sales floor.
label: Backroom
term status: unstable

BANK
type: Location Role Code
comment: A location offering financial services to consumers and/or businesses.
label: Bank
term status: stable

BERTH
type: Location Role Code
comment: A berth is a specialised space or part of a wharf space assigned to or taken up by a ship or vessel when anchored or stationary alongside a quay, wharf, jetty, or other structure. As a berth is usually a straight line segment between two points, a wharf may consist of several individual berths and represent a grouping of berths.
label: Berth
term status: stable

BIRTH_AREA
type: Location Role Code
comment: The place the animal was born/hatched. Note: the term animal includes but is not limited to mammals, birds, fish and crustaceans.
label: Birth Area
term status: unstable

BOAT
type: Location Role Code
comment: A watercraft of a large range of types and sizes, but generally smaller than a ship,
label: Boat
term status: unstable

BOTTLING_SITE
type: Location Role Code
comment: A location or area within a larger location where beverages are bottled.
label: Bottling Site
term status: stable

BOX_CRUSHER
type: Location Role Code
comment: A Baler used to compact recycled materials (e.g. corrugated boxes, slip sheets and packaging material).
label: Box Crusher
term status: unstable

BRANCH_LOCATION
type: Location Role Code
comment: A location for an organization segment that operates in a different physical location or jurisdiction than its parent organization, although is considered as an extension of the parent organization (i.e., same legal entity.).
label: Branch Location
term status: stable

CASH_CARRY_STORE
type: Location Role Code
comment: Location where goods are paid for in full at the time of purchase and taken away by the purchaser.
label: Cash and Carry Store
term status: stable

CITY_CENTER_SHOP
type: Location Role Code
comment: The product is intended to be sold in a city center. A city center shop is centrally located in the commercial, cultural and often the historical, political and geographic heart of a city, especially those in the Western world.
label: City Center Shop
term status: unstable

CLINIC
type: Location Role Code
comment: A location serving as a health facility, often associated with a hospital, care practitioner or medical school for example, that is primarily focused on the care of outpatients, where medical treatment or advice can be administered, especially of a specialist nature.
label: Clinic
term status: stable

CLINICAL_TRIAL_SITE
type: Location Role Code
comment: A location designated by a healthcare provider as a site where clinical trials are conducted. In many cases clinical trial sites are hospital facilities with specialised hospital pharmacies, or retail pharmacies on site, but may also include trial specific sites such as a clinical trial subject's residence.
label: Clinical Trial Site
term status: stable

COLLECTION_CENTER
type: Location Role Code
comment: A location where purchased products may be collected by the purchaser or a delegated party.
label: Collection Center
term status: stable

CONSOLIDATING_CENTER
type: Location Role Code
comment: A facility where smaller shipments or consignments are combined into larger consignments bound for a destination.
label: Consolidating Center
term status: stable

CONSTRUCTION_SITE
type: Location Role Code
comment: A construction site is an area or piece of land on which construction works are being carried out.
label: Construction Site
term status: unstable

CONTAINER_DECK
type: Location Role Code
comment: An area on board a shipping vessel where containers are loaded.
label: Container Deck
term status: unstable

CONTROLLED_SUBSTANCE_AREA
type: Location Role Code
comment: A caged and locked area in which regulated, controlled substance pharmaceuticals are held while awaiting shipment.
label: Controlled Substance Area
term status: unstable

CONVENIENCE_STORE
type: Location Role Code
comment: A location for a type of small format retail store often located with or connected to a gas/fuel station. Convenience stores usually provide extended trading hours, operating earlier and later than traditional retail stores.
label: Convenience Store
term status: stable

CONVEYOR_BELT
type: Location Role Code
comment: A continuous moving strip or surface that is used for transporting single cartons or a load of objects from one place to another.
label: Conveyor Belt
term status: unstable

CORRECTION_FACILITY
type: Location Role Code
comment: Provides detention and rehabilitative services to inmates
label: Correction Facility
term status: unstable

CUSTOMER_PICK-UP_AREA
type: Location Role Code
comment: An area, usually within a store or collection center, that is reserved specifically for consumers to collect goods purchased online (sometimes known as 'click and collect'), or goods purchased in store to be collected at a later time or date (e.g., paid in instalments, bulky goods, goods requiring staff assistance etc). A customer pick-up area may also enable access by vehicle.
label: Customer Pick-Up Area
term status: stable

CUSTOMS_BORDER_CONTROL
type: Location Role Code
comment: A location where cross-border procedures and formalities may be executed and fulfilled. Examples of these include passport control, importation of goods, sanitary and phytosanitary (SPS) formalities etc.
label: Customs Border Control
term status: stable

DENTAL_HEALTH_SERVICE
type: Location Role Code
comment: Provides oral health treatment and support services
label: Dental health service
term status: unstable

DEPOT
type: Location Role Code
comment: A location where vehicles such as those used for transportation (e.g., trucks, trains) or services (e.g., mobile food truck, exhibition cart) can be housed, maintained and deployed from.
label: Depot
term status: stable

DISPENSER
type: Location Role Code
comment: Tablet, caplet or capsule dispensing machine in which bulk product has been placed to be dispensed on a prescription basis.
label: Dispenser
term status: unstable

DISTRIBUTION_CENTER
type: Location Role Code
comment: A specialised warehouse space that serves as a hub for the strategic storage of goods, for the purpose of picking, packing and shipping to another location, or the final destination.
label: Distribution Center
term status: stable

DOCK
type: Location Role Code
comment: An area within a facility where transportation such as trucks or rail cars can be loaded with goods for dispatch (i.e., outbound shipping, or sending) or unloaded with goods delivered (i.e., inbound shipping or receiving). Sometimes known as a dock door, a loading or unloading dock or bay, these areas are also used to hold goods temporarily ahead of being stored, or loaded for delivery, so may also include controlled environments such as for cold storage. Docks are designated for use with inbound or outbound shipments, to enable transportation carriers to schedule their arrival for loading or unloading based on dock availability and other critical logistics details such as dock heights, storage conditions and type of equipment on hand. Dock use designations can change frequently based on facility capacity and day-to-day events.
label: Dock
term status: stable

DOCTOR_OFFICE
type: Location Role Code
comment: A room or clinic where a doctor works.
label: Doctor office
term status: unstable

DRUG_STORE
type: Location Role Code
comment: Establishment that offers personal care goods, toiletries and non-controlled drugs which can be obtained without a prescription. Within the Netherlands this establishment is a different than a retail pharmacy (referred to in the code list as DRUG).
label: Drugstore
term status: unstable

DUTY_FREE_STORE
type: Location Role Code
comment: A location for a type of retail store that is exempt from the payment of certain local or national taxes and duties, on the requirement that the goods sold will be sold to travellers who will take them out of the country. Duty-free stores are usually located within an international travel facility such as an airport or passenger terminal for rail or ferry.
label: Duty Free Store
term status: stable

EARLY_CHILDHOOD_EDUCATING_AND_CENTER
type: Location Role Code
comment: Premises used regularly for the education or care of children who are pre-school age or younger.
label: Early Childhood Education and Center
term status: unstable

EDI_STATION
type: Location Role Code
comment: Digital location where the EDI messages can be sent and received from.
label: EDI Station
term status: stable

EDUCATION_FACILITY
type: Location Role Code
comment: A location used as a public or private education premise where primary, secondary or tertiary education is conducted.
label: Education Facility
term status: stable

ELECTRONICS_AREA
type: Location Role Code
comment: A specific area within the store for holding electronic products such as TV's, DVD players, etc.
label: Electronics Area
term status: unstable

EMERGENCY_DEPARTMENT_AREA
type: Location Role Code
comment: An area of a hospital especially equipped and staffed for emergency care.
label: Emergency Department Area
term status: stable

END_CAP_AREA
type: Location Role Code
comment: A specific internal location on the sales floor, typically at the end of an aisle, for displaying product.
label: End Cap Area
term status: unstable

ENTRANCE_GATE
type: Location Role Code
comment: A location that is a type of opening to allow entry to an enclosed place such as a terminal, warehousing, healthcare facility, or agricultural facility or parts thereof for example. For a gate designated as an exit only, see EXIT_GATE. For a gate designated as both an entry and exit, see GATE.
label: Entrance Gate
term status: stable

EXIT_GATE
type: Location Role Code
comment: A location that is a type of opening to allow exit from an enclosed place such as a terminal, warehousing, healthcare facility, or agricultural facility or parts thereof for example. For a gate designated as an entry only, see ENTRANCE_GATE. For a gate designated as both an entry and exit, see GATE.
label: Exit Gate
term status: stable

FARM
type: Location Role Code
comment: A location used for agricultural production purposes, such as for growing crops, rearing animals or both. A farm often serves as a hub for a variety of agricultural activities and typically consists of various structures or areas such as barns, silos, feed areas or fields for example.
label: Farm
term status: stable

FEEDLOT_SITE
type: Location Role Code
comment: A location or area within a larger location where livestock are fed.
label: Feedlot Site
term status: stable

FIELD
type: Location Role Code
comment: An area of open land, that may be used for agricultural purposes, such as for growing crops and/or rearing animals. A field may or may not be part of a farm, as it may also exist as a fenced but open space for pasture, devoid of infrastructure such as a wild meadow.
label: Field
term status: stable

FIXED_READER
type: Location Role Code
comment: A location equipped with any fixed read point configuration (reader and antennas) for the purpose of capturing data from an RFID device (e.g. read points at doorways or conveyors).
label: Fixed Reader
term status: stable

FIXED_TRANSPORT_FACILITIES
type: Location Role Code
comment: A location with permanent facilities to load or discharge cargo, that does not fit within a maritime, rail, road, air, or multimodal type facility. For example, an oil platform or terminal.
label: Fixed Transport Facilities
term status: stable

FOOD_BUSINESS
type: Location Role Code
comment: A location for businesses selling prepared food to consumers such as cafes, restaurants, food trucks.
label: Food Business
term status: stable

FREIGHT_HUB
type: Location Role Code
comment: A location that is an interchange point at which equipment or goods are exchanged between drivers and/or transport operators.
label: Freight Hub
term status: stable

FREIGHT_TERMINAL
type: Location Role Code
comment: An assigned area in which shipping containers of any type and size are prepared for loading into a transportation vehicle (e.g., truck, train, vessel or aeroplane) or where the containers are stacked immediately after unloading from a transportation vehicle.
label: Freight Terminal
term status: stable

GARDEN_CENTER
type: Location Role Code
comment: An establishment where plants and gardening equipment are sold.
label: Garden Center
term status: unstable

GATE
type: Location Role Code
comment: A location that is a type of opening to allow both entry to and exit from an enclosed place such as a terminal, warehousing, healthcare facility, or agricultural facility or parts thereof, for example. For a gate designated as an entry only, see ENTRANCE_GATE. For a gate designated as an exit only, see EXIT_GATE.
label: Gate
term status: stable

GENERAL_MDSE_AREA
type: Location Role Code
comment: An area where typically - non-food products other than perishable, dry groceries and health and beauty care products that are displayed in stores on standard shelving. Examples include household cleaning products, paper napkins, laundry detergents, and insect repellents
label: General Merchandise Area
term status: unstable

GOVERNMENT_DEPARTMENT_AGENCY
type: Location Role Code
comment: Location where a government body conducts operations.
label: Government Department Agency
term status: unstable

GREENHOUSE
type: Location Role Code
comment: A location where plants are grown and cultivated, within an enclosed or semi-enclosed environment, often within a covered indoor space. Includes temporary or semi-permanent structures.
label: Greenhouse
term status: stable

GROCERY
type: Location Role Code
comment: An area where household grocery products, such as fresh or shelf stable foods, domestic cleaning supplies, personal hygiene items, for example, that are displayed in stores on standard shelving.
label: Grocery
term status: stable

HANDLING_AREA
type: Location Role Code
comment: An operational area where internal activities associated with storing, moving, protecting or other handling of goods take place throughout the processes of manufacturing, warehousing or distribution.
label: Storage and Handling Area
term status: stable

HEAD_OFFICE
type: Location Role Code
comment: A location that serves as the executive or main office of an organization.
label: Head Office
term status: stable

HOSPITAL
type: Location Role Code
comment: A location where health care organizations provide patient treatment with specialised medical and nursing staff, medical equipment and inpatient care facilities.
label: Hospital
term status: stable

HOSPITAL_CAFETERIA
type: Location Role Code
comment: A restaurant within a hospital or other medical facility in which the customers serve themselves or are served at a counter.
label: Hospital Cafeteria
term status: unstable

HOSPITAL_DEPARTMENT
type: Location Role Code
comment: An area within a hospital which provides specific treatment or support services not individually included in the Location Type list.
label: Hospital Department
term status: unstable

HOSPITAL_PHARMACY
type: Location Role Code
comment: A location within a hospital where pharmaceuticals or medical devices can be dispensed by a pharmacy operator to hospital staff for inpatient treatment as well as directly to patients being discharged. Differs to a retail pharmacy as the site may be related to government funding, subsidized reimbursement lists or agencies, and may also dispense specialized pharmaceuticals (e.g., orphan drugs).
label: Hospital Pharmacy
term status: stable

IMAGING_DIAGNOSTICS_AREA
type: Location Role Code
comment: An area within a healthcare facility, usually a hospital or radiology facility, designated for the purpose of imaging and diagnostics.
label: Imaging Diagnostics Area
term status: stable

IMPREST_LOCATION
type: Location Role Code
comment: Usually a ward-level location in which stock is held for use on that ward.
label: Imprest Location
term status: unstable

INLAND_FISHERY
type: Location Role Code
comment: A location devoted to the rearing and harvesting of aquatic animals and plants within an inland freshwater ecosystem (i.e., fresh or limnetic waters) for industrial, small-scall/artisanal or recreational purposes. Includes natural flowing or lotic waters such as rivers or streams (including their smaller elements such as springs, brooks, rivulets, or rills), artificial canals, and static or lentic waters such as natural lakes and tarns and artificial lakes or reservoirs such as rivers, lakes, etc.
label: Inland Fishery
term status: stable

INLAND_PORT
type: Location Role Code
comment: A location with permanent facilities, situated along inland waterways, where inland waterway ships and vessels may dock to receive services such as loading and discharging passengers, crews or cargo, refuelling, restocking, etc.
label: Inland Port
term status: stable

INTERMODAL_TERMINAL
type: Location Role Code
comment: A location that is a specific type of terminal, which supports the transfer between various modes of transport such as rail, road, maritime, inland waterways.
label: Intermodal Terminal
term status: stable

INTERNATIONAL_MAIL_PROCESSING_CENTER
type: Location Role Code
comment: A location with mail processing facilities recognized by the Universal Postal Union (UPU) that generates or receives dispatches and/or acts as a transit center for mail exchanged between other International Mail Processing Centers (IMPC).
label: International Mail Processing Center
term status: stable

LANE_OR_ROUTE
type: Location Role Code
comment: A specific transportation lane or route.
label: Lane or route
term status: unstable

LAY-AWAY
type: Location Role Code
comment: An area within a store for holding or consolidating customer purchases for final payment and pickup.
label: Lay-Away
term status: unstable

LIBRARY
type: Location Role Code
comment: A building or room containing collections of books, periodicals, and sometimes films and recorded music for use or borrowing by the public or the members of an institution.
label: Library
term status: stable

MAIN_RECEPTION
type: Location Role Code
comment: An area within a facility, often near the entrance, that is used predominantly to greet visitors to the building.
label: Main Reception
term status: stable

MANUFACTURING_PLANT
type: Location Role Code
comment: A location consisting of one or more buildings with facilities for manufacturing.
label: Manufacturing Plant
term status: stable

MARINE_FISHERY
type: Location Role Code
comment: A location devoted to the rearing and harvesting of aquatic animals and plants within a marine saltwater ecosystem (i.e., open sea/pelagic zone), for industrial, small-scall/artisanal or recreational purposes.
label: Marine Fishery
term status: stable

MARKET
type: Location Role Code
comment: A location where multiple sellers can set-up mobile stalls, booths or stores, to sell various goods to consumers. Markets often include a wide variety of goods such as fresh produce, handcrafts, artisan products for example, and may also include 'pop-up' type stores that are temporary or move from market to market.
label: Market
term status: stable

MENTAL_HEALTH_SERVICE
type: Location Role Code
comment: Provides mental health treatment and support services.
label: Mental Health Service
term status: unstable

MILKING_SITE
type: Location Role Code
comment: Milking is the act of removing milk from mammary glands of various animal types.
label: Milking Site
term status: unstable

MOBILE_READER
type: Location Role Code
comment: Any non-fixed (portable) reader configuration (reader and antennas) for the purpose of capturing EPC data (e.g. Hand held or forklift reader).
label: Mobile Reader
term status: unstable

NURSE_STATION
type: Location Role Code
comment: Nurse station within a hospital or other healthcare service provider
label: Nurse Station
term status: unstable

OFFICE
type: Location Role Code
comment: A room, set of rooms, or building where the business of a commercial or industrial organization or an individual professional is conducted.
label: Office
term status: stable

ONLINE_PLATFORM
type: Location Role Code
comment: A digital location offering online services that utilize the internet to facilitate interactions between two or more distinct but interdependent sets of users. Includes graphical user interfaces for human interaction and/or system interfaces for connection with other digital services (e.g., APIs). Examples include search engines, marketplaces, online financial systems, distribution management entities (DME) etc.
label: Online Platform
term status: stable

ONLINE_SHOP
type: Location Role Code
comment: A digital location where a varied selection of goods or services can be sold to a consumer, by a single seller who may also operate physical stores offering the same varied selection of goods or services under their own brand name or from different brands. Differs to an online platform marketplace, which enables multiple sellers to offer goods and services through the same platform.
label: Online Shop
term status: stable

OPERATING_THEATER
type: Location Role Code
comment: A facility usually within a hospital used to perform medical/surgical procedures.
label: Operating Theater
term status: unstable

PACKAGING_AREA
type: Location Role Code
comment: An area within a facility where product is packaged.
label: Packaging Area
term status: unstable

PACKHOUSE
type: Location Role Code
comment: A location (standalone or part of a larger facility) where fresh foods such as fruit, vegetables, grains, meat or horticultural products, for example, are sorted, prepared and packed ahead of distribution to shops or markets for sale to end users.
label: Packhouse
term status: stable

PALLET_WRAPPER
type: Location Role Code
comment: An area where any automatic or manual method using bands of plastic film applied to product used to encase palletised loads prior to shipment to protect against product damage.
label: Pallet Wrapper
term status: unstable

PATHOLOGY
type: Location Role Code
comment: Pathology area within a hospital or independently operated.
label: Pathology
term status: unstable

PERSONAL_SERVICES
type: Location Role Code
comment: Business providing personal services such as beauty therapy, tattoo parlours, hair salons etc.
label: Personal Services
term status: unstable

PETROL_STATION
type: Location Role Code
comment: An establishment beside a road selling fuel for motor vehicles.
label: Petrol Station
term status: unstable

PICK-UP_LOCATION
type: Location Role Code
comment: A location where goods may be temporarily stored until collected or loaded to a shipment for the next part of a transportation process.
label: Pick-Up Location
term status: stable

PICKING_AREA
type: Location Role Code
comment: An area within a facility in which product is picked to fulfil an order.
label: Picking Area
term status: stable

POINT_OF_SALE
type: Location Role Code
comment: An area, usually within a store, commonly known as a 'checkout', where barcodes on trade items can be scanned to enable a consumer purchase and to complete and record the transaction for the seller.
label: Point Of Sale
term status: stable

PRIMARY_HEALTH_SERVICE
type: Location Role Code
comment: A health service which provides a first point of consultation for patients. Includes community centres.
label: Primary Health Service
term status: unstable

PRINTING_ROOM
type: Location Role Code
comment: An area which provides printed labels/tags for the goods/cartons/pallets within a DC or manufacturer facility.
label: Printing Room
term status: unstable

PRODUCTION_AREA
type: Location Role Code
comment: An area within a facility where the conversion of materials and or assembly of components to manufacture goods, products or services takes place.
label: Production Area
term status: unstable

PRODUCTION_LINE
type: Location Role Code
comment: An area in a factory in which goods being manufactured is passed through a set linear sequence of mechanical or manual operations.
label: Production Line
term status: unstable

PROMOTION_AREA
type: Location Role Code
comment: A specific area or room that is used to hold special purchased product.
label: Promotion Area
term status: unstable

PUBLIC_WAREHOUSE
type: Location Role Code
comment: A building, or a part of one, where storage space is offered to other companies for compensation (fee), for the storage of their goods, merchandise, etc.
label: Public Warehouse
term status: stable

QUALITY_CONTROL
type: Location Role Code
comment: An area in which any product not meeting quality standards is held pending further evaluation.
label: Quality Control
term status: unstable

QUARANTINE
type: Location Role Code
comment: An area at a manufacturing, distribution or retail facility to hold product that may not be suitable for consumption until further inspection.
label: Quarantine
term status: unstable

RAIL_STATION
type: Location Role Code
comment: A location with one or more buildings/platforms where trains can stop for people to embark and disembark.
label: Rail Station
term status: stable

RAIL_TERMINAL
type: Location Role Code
comment: A location with one or more railway terminals such as freight terminals or rail stations (excluding passenger terminals), that provides connections with other rail vehicles and other modes of transport.
label: Rail Terminal
term status: stable

READ_POINT_VERIFICATION_SPOT
type: Location Role Code
comment: A point at which a tagged object's location has been verified by an associated read of a separate fixed location tag. Read Point Verification Spot would be used when there is a business process to capture the current location of an object at rest (typically with a mobile reader).
label: Read Point Verification Spot
term status: unstable

REARING_AREA
type: Location Role Code
comment: The place the animal was raised after birth to the end of the animals' life. Note: the term animal includes but is not limited to mammals, birds, fish and crustaceans.
label: Rearing Area
term status: unstable

RECALLED_PRODUCT_AREA
type: Location Role Code
comment: An area in which recalled product is stored pending shipment back to the manufacturer or the manufacturer's designated returns centre for final disposition.
label: Recalled Product Area
term status: unstable

RECEIVING_AREA
type: Location Role Code
comment: An area within a facility where incoming goods are unloaded and checked for condition and completeness.
label: Receiving Area
term status: stable

RECEIVING_LOCATION
type: Location Role Code
comment: A location where goods may be temporarily received and stored for the purpose of unloading shipments.
label: Receiving Location
term status: stable

REPACKING_FACILITY
type: Location Role Code
comment: A location where goods may be combined with other goods and packed for sale or shipping distribution as a single pack. For locations where transport units are combined for shipping, see CONSOLIDATING_CENTER.
label: Repacking Facility
term status: stable

RESEARCH_FACILITY
type: Location Role Code
comment: An institute, centre, or other location where research is conducted.
label: Research Facility
term status: unstable

RESIDENCE
type: Location Role Code
comment: A dwelling or an apartment where one lives.
label: Residence
term status: unstable

RETAIL_PHARMACY
type: Location Role Code
comment: A location for a retail store that sells and/or dispenses pharmaceuticals and medical devices to the general public, often at the direction of physicians. Quite often also sells personal care goods, toiletries and non-controlled or over-the-counter (OTC) drugs.
label: Retail Pharmacy
term status: stable

RETURNABLE_ASSET_SERVICE_CENTER
type: Location Role Code
comment: The location where a returnable asset is serviced.
label: Returnable Asset Service Center
term status: stable

RETURNS_AREA
type: Location Role Code
comment: An area where goods, that have been dispatched to be delivered, are received back into a facility for further processing. Examples of processing include sorting, cleaning, resale, onward transportation to other specialized facilities, destruction, etc.
label: Returns Area
term status: stable

ROAD_TERMINAL
type: Location Role Code
comment: A location that is connected to other locations by means of roads.
label: Road Terminal
term status: stable

SALES_FLOOR
type: Location Role Code
comment: An area within a store (all formats - club, etc.) where product is displayed for customer purchase.
label: Sales Floor
term status: unstable

SALES_FLOOR_TRANSITION_AREA
type: Location Role Code
comment: An area within a store between two physical locations (e.g. Backroom and Sales Floor) - used for a read point only.
label: Sales Floor Transition Area
term status: unstable

SALES_YARD
type: Location Role Code
comment: A location for individuals or companies to sell used goods.
label: Sales Yard
term status: unstable

SEAPORT
type: Location Role Code
comment: A location with maritime facilities, at which both seagoing and inland waterway ships and seagoing vessels may dock to receive services such as loading and discharging passengers, crews or cargo, refuelling, restocking, repair.
label: Seaport
term status: stable

SECURITY_AREA
type: Location Role Code
comment: A designated internal location for the purpose of minimising direct access to the product.
label: Security Area
term status: unstable

SELF_SERVICE
type: Location Role Code
comment: The product should be placed in an area where the consumer can self serve themselves to their purchase needs. The product may have been portioned, cut or modified prior.
label: Self Service
term status: unstable

SERVICE_COUNTER
type: Location Role Code
comment: The product is recommended to be placed at a location where an employee from the trading partner will need to portion, cut, or modify the product to the end consumer based upon consumer need.
label: Service Counter
term status: unstable

SHELF
type: Location Role Code
comment: A location specified within a larger area, used to hold or store objects. A shelf is generally a flat, rigid surface or structure which may usually be composed of wood, glass or metal, fixed at right angles to a wall or other vertical structure.
label: Shelf
term status: stable

SHIPPING_AREA
type: Location Role Code
comment: An area within a facility where outgoing goods are checked for condition and completeness and loaded onto a conveyance for transport.
label: Shipping Area
term status: stable

SHIP_FROM_LOCATION
type: Location Role Code
comment: The location from which physical goods are shipped. In cases when a shipment may be completed through a single consignment, the ship from location is the same location that is managed by the dispatch party or used by the consignor. However in cases when a shipment involves multiple consignments, there will various ship from locations, that do not necessarily correspond to the same locations associated with the consignors or dispatch parties.
label: Ship From Location
term status: stable

SHIP_TO_LOCATION
type: Location Role Code
comment: The location to which physical goods are shipped. In cases when a shipment may be completed through a single consignment, the ship to location is the same location that is managed by the delivery recipient party or used by the consignee. However in cases when a shipment involves multiple consignments, there will be various ship to locations, that do not necessarily correspond to the same locations associated with the consignees or delivery recipient parties.
label: Ship To Location
term status: stable

SILO
type: Location Role Code
comment: A location or area within a larger location, used to store grain within a tower or pit.
label: Silo
term status: stable

SLAUGHTER_HOUSE
type: Location Role Code
comment: A facility where animals are slaughtered for meat as food.
label: Slaughterhouse
term status: stable

SPORTS_AND_RECERATIONAL
type: Location Role Code
comment: A location for individuals to engage in sports and recreational activities for leisure.
label: Sports and Recreational
term status: unstable

STAGING_AREA
type: Location Role Code
comment: A location where goods may be stored temporarily between two separate stages or parts of an overall inbound or outbound goods process. E.g., received and approved goods may sit in a staging area before they are put away into the main storage area of the warehouse. Another example is when components for a manufacturing process are temporarily placed in a staging area between the warehouse and the manufacturing shop floor until those components can be taken to the correct workstations on the manufacturing shop floor.
label: Staging Area
term status: stable

STATION
type: Location Role Code
comment: An establishment or building where a specified activity or service is based.
label: Station
term status: unstable

STORAGE_AREA
type: Location Role Code
comment: An area within a facility where material or goods are kept to fulfil a future need. Examples of facilities include shops, manufacturing plants, distribution centers, yards, depots, etc.
label: Storage Area
term status: stable

STORE
type: Location Role Code
comment: A location where a varied selection of goods or services can be sold to a consumer.
label: Store
term status: stable

TERMINAL
type: Location Role Code
comment: A location which serves as a pathway for handling transport processes that may involve cargo and people, such as passengers or crew, for example.
label: Terminal
term status: stable

TRADE_ITEM_RETURN_LOCATION
type: Location Role Code
comment: A code to qualify the locations to which a retailer or wholesaler can send unsold product. Examples are expired product, damaged, reclamation or general product returns.
label: Trade Item Return Location
term status: unstable

TRAIN
type: Location Role Code
comment: A form of rail transport consisting of a series of connected vehicles that generally run along a railroad (or railway) track to transport passengers or cargo (also known as 'freight' or 'goods').
label: Train
term status: unstable

VENDING
type: Location Role Code
comment: The retailing merchandise through vending machines.
label: Vending
term status: unstable

VENDOR_LEASED_SPACE
type: Location Role Code
comment: A trade channel where the trade item is sold through a retailer within a retailer for example a rack jobber.
label: Vendor Leased Space
term status: unstable

VINEYARD
type: Location Role Code
comment: An area where grape vines are grown in order to produce wine.
label: Vineyard
term status: unstable

VISITING_ADDRESS
type: Location Role Code
comment: An enterprise's physical location where guests are received during set working hours.
label: Visiting Address
term status: unstable

WARD
type: Location Role Code
comment: Usually, a sub-location within a hospital typically one allocated to a particular type of patient.
label: Ward
term status: unstable

WAREHOUSE
type: Location Role Code
comment: A location equipped with the appropriate equipment and fittings for large quantities of items such as raw materials or manufactured goods to be stored in the appropriate conditions prior to distribution e.g., cold storage. A warehouse is a facility that, along with appropriate storage and handling equipment includes personnel and management resources, enabling to stocking or storage of goods and control of inbound goods (e.g., such as those received from suppliers, production centets, etc.) and outbound goods (e.g., such as those being sent to production, sales, etc.).
label: Warehouse
term status: stable

WASTE_CENTER
type: Location Role Code
comment: An area within a parent location designated for the central depositing of waste streams prior to collection.
label: Waste Center
term status: unstable

WHARF
type: Location Role Code
comment: A wharf or quay is a fixed location with a structure built parallel to the waterfront of a harbour, navigable river or any body of water so that ships and vessels may lie alongside for docking, loading, and unloading purposes.
label: Wharf
term status: stable

YARD
type: Location Role Code
comment: A tract of ground next to, surrounding, or surrounded by a building or buildings, used for holding product (e.g., ores, sand) or equipment (e.g. trailer, container, wagons) or transport means (e.g., trucks, tractors, locomotives).
label: Yard
term status: stable

Luminance
type: Measurement type
comment: A measure of the light-emitting intensity of a light source, in a specific direction per unit area of the emitting surface. For a very narrow cone containing the direction, it is the ratio of the luminous flux emitted within that cone to the solid angle of the cone per unit area of the emitting surface. SI Units: candela per square metre

LuminousFlux
type: Measurement type
label: Luminous flux
comment: A measure of the perceived power of light emitted by a source or received by a surface and irrespective of direction, taking into account the sensitivity of the human eye to different wavelengths of light. SI Units: lumen = 1 candela per steradian

LuminousIntensity
type: Measurement type
label: Luminous intensity
comment: A measure of the light-emitting intensity of a light source, in a specific direction. For a very narrow cone containing the direction, it is the ratio of the luminous flex emitted within that cone to the solid angle of the cone. SI Units: candela

MagneticFlux
type: Measurement type
label: Magnetic flux
comment: A measure of the total magnetic field that passes through a specific area. The surface integral of the product of the permeability of the medium and the magnetic field intensity perpendicular to the surface. SI Units: weber

MagneticFluxDensity
type: Measurement type
label: Magnetic flux density
comment: The product of the magnetic field strength and the permeability of a material. SI Units: tesla = weber per square metre

MagneticVectorPotential
type: Measurement type
label: Magnetic vector potential
comment: The potential energy per unit element of current (current multiplied by length). SI Units: weber per metre (Joules per ampere metre)

Mass
type: Measurement type
comment: The quantity of matter in a body. Inertial mass is the measure of the inertia of a body; its resistance to acceleration. SI Units: kilogram

MassConcentration
type: Measurement type
label: Mass concentration
comment: The mass of the consistutent (or solute) divided by the volume of the mixture (or solvent). SI Units: kilogram per cubic metre

MassFlowRate
type: Measurement type
label: Mass flow rate
comment: The mass of fluid that passes per unit of time. SI Units: kilogram per second

MassPerAreaTime
type: Measurement type
label: Mass flux / Mass per area per time
comment: The mass of fluid that passes per unit of time per unit area perpendicular to the flow direction. SI Units: kilogram per second per square metre

JET_FRESH
type: Maturation Method Code
comment: Freshly picked and immediately packed and shipped at mature stage and flown to destination for adequate distribution (i.e. imports from South America, Africa or Europe). Flown by jet to market; the carton will be labelled Jet Fresh, when applicable, stickered Jet Fresh. For the produce industry, most common with berries, stone fruits and pineapples.
label: Jet Fresh

PRECONDITIONED
type: Maturation Method Code
comment: Product stored at proper temperature prior to shipment to allow ripening and/or colouring, adequate for distribution and/or consumption. Pre-conditioned product is matured to a specific maturity level as a result of ripening through either temperature, gas treatment, humidity or any combination thereof.
label: Preconditioned

TREE_VINE_RIPE
type: Maturation Method Code
comment: Product that is picked at optimum maturity or just shy of. It is almost ripe or ready to eat. This fruit will be shipped immediately (imported = flown) from the pack-house and stickered as Tree or Vine Ripe.
label: Tree Vine Ripe

APPROXIMATELY
type: Measurement Precision Code
comment: The method used to analyse the products resulted in approximate value of the nutritional content.
label: Approximately

EXACT
type: Measurement Precision Code
comment: The method used to analyse the products resulted in exact value of the nutritional content.
label: Exact

LESS_THAN
type: Measurement Precision Code
comment: To indicate presence when the measurement value is too small to be measured precisely (rule states less than 0.5).
label: Less Than

MemoryCapacity
type: Measurement type
label: Memory capacity
comment: A measure of the size of a data structure or capacity of a data carrier, typically measured in bits (binary digits), bytes or octets (8 bits) or multiples thereof. Units: byte

MolalityOfSolute
type: Measurement type
label: Molality of solute
comment: The concentration of a solution expressed as the number of moles of dissolved substance per unit mass of solvent. SI Units: mole per kg

MolarEnergy
type: Measurement type
label: Molar thermodynamic energy
comment: The ratio of the thermodynamic energy of a chemical compound to the amount of substance (atoms or molecules) contained within it, the amount of substance being measured in moles. SI Units: joule per mole

MolarMass
type: Measurement type
label: Molar mass
comment: The ratio of the mass of a chemical compound to the amount of substance (atoms or molecules) contained within it, the amount of substance being measured in moles. SI Units: kilogram per mole

MolarVolume
type: Measurement type
label: Molar volume
comment: The volume occupied by a substance per unit amount of substance at a specified temperature and pressure. SI Units: cubic metre per mole

FALSE
type: Nonbinary Logic Code
label: False

NOT_APPLICABLE
type: Nonbinary Logic Code
label: Not Applicable

TRUE
type: Nonbinary Logic Code
label: True

UNSPECIFIED
type: Nonbinary Logic Code
label: Unspecified

BY_MEASURE
type: Nutrient Basis Quantity Code
comment: Nutrient measurement is based on a measurement value for example grams or ounces.
label: By Measure

BY_SERVING
type: Nutrient Basis Quantity Code
comment: Nutrient measurement is based on a specified serving amount.
label: By Serving

ADDITIVE_FREE
type: Nutritional Claim Type Code
comment: A claim that a food is free from additives. Note the amount that determines containment or lack of containment is based on target market regulations.
label: Additive Free

ARTIFICIALLY_SWEETENED
type: Nutritional Claim Type Code
comment: A claim that a food contains artificial sweeteners. Artificial sweeteners are sugar substitutes that are synthetic.
label: Artificially Sweetened

CHOLESTEROL_FREE
type: Nutritional Claim Type Code
comment: A claim that a food is free from Cholesterol. Note the amount that determines containment or lack of containment is based on target market regulations.
label: Cholesterol Free

COLOURING_AGENT_FREE
type: Nutritional Claim Type Code
comment: A claim that a food is free from colouring agents. Note the amount that determines containment or lack of containment is based on target market regulations.
label: Colouring Agent Free

CONTAINS_GLYZYRRHIZIN
type: Nutritional Claim Type Code
comment: A claim that a food contains glyzyrrhizin. Note the amount that determines containment or lack of containment is based on target market regulations.
label: Contains Glyzyrrhizin

CONTAINS_LIQUORICE
type: Nutritional Claim Type Code
comment: A claim that a food is contains liquorice. Note the amount that determines containment or lack of containment is based on target market regulations.
label: Contains Liquorice

CONTAINS_SOY
type: Nutritional Claim Type Code
comment: A claim that a food contains soy. Note the amount that determines containment or lack of containment is based on target market regulations.
label: Contains Soy

EGG_FREE
type: Nutritional Claim Type Code
comment: A claim that a food is free from egg. Note the amount that determines containment or lack of containment is based on target market regulations.
label: Egg Free

ENERGY_FREE
type: Nutritional Claim Type Code
comment: A claim that a food is energy-free, and any claim likely to have the same meaning for the consumer, may only be made where the product contains less than 4kcal (17kj)/100ml. In the case of energy-free foods, the term naturally may be used as a prefix to this claim.
label: Energy Free

ENERGY_REDUCED
type: Nutritional Claim Type Code
comment: A claim that a food is energy-reduced, and any claim likely to have the same meaning for the consumer, may only be made where the energy value is reduced by at least 30%, with an indication of the characteristic(s), which make(s) the food reduced in its total energy value.
label: Energy Reduced

ENRICHED_OR_FORTIFIED_IN_VITAMINS_AND_OR_MINERALS
type: Nutritional Claim Type Code
comment: A claim that a food is enriched or fortified in vitamins and/or minerals, and any claim likely to have the same meaning for the consumer, may only be made where the product contains the vitamins and/or minerals in at least a significant amount as defined in the Annex of Directive 90/496/EEC.
label: Enriched or Fortified in Vitamins Minerals

FAT_FREE
type: Nutritional Claim Type Code
comment: A claim that a food is fat-free, and any claim likely to have the same meaning for the consumer, may only be made where the product contains no more than 0.5g of fat per 100g or 100ml. However, claims expressed as X% fat-free shall be prohibited. In the case of foods naturally fat-free, the term naturally may be used as a prefix to this claim.
label: Fat Free

FREE_FROM_GLUTEN
type: Nutritional Claim Type Code
comment: A claim that a food is free from Gluten. Any claim likely to have the same meaning for the consumer, may only be made where the product contains an amount less than or equal to 20 mg/kg gluten according to the Commission Regulation (EC) No 41/2009
label: Free From Gluten

GUARANTEED_LACTOSE_FREE
type: Nutritional Claim Type Code
comment: A claim that a food is regularly analysed to guarantee that the product is free from lactose.
label: Guarantee Lactose Free

HIGH_FIBRE
type: Nutritional Claim Type Code
comment: A claim that a food is high in fibre, and any claim likely to have the same meaning for the consumer, may only be made where the product contains at least 6g of fibre per 100g or at least 3g of fibre per 100 kcal. In the case of foods naturally high in fibre, the term naturally may be used as a prefix to this claim.
label: High Fibre

HIGH_PROTEIN
type: Nutritional Claim Type Code
comment: A claim that a food is high in protein, and any claim likely to have the same meaning for the consumer, may only be made where at least 20% of the energy value of the food is provided by protein. In the case of foods naturally high in protein, the term naturally may be used as a prefix to this claim.
label: High Protein

HIGH_VITAMINS_AND_OR_MINERALS
type: Nutritional Claim Type Code
comment: A claim that a food is high in vitamins and or minerals, and any claim likely to have the same meaning for the consumer, may only be made where the product contains at least twice the value of source of vitamins and minerals. In case of foods naturally high in vitamins and/or minerals, the term naturally may be used as a prefix to this claim.
label: High in Vitamins Minerals

LACTOSE_FREE
type: Nutritional Claim Type Code
comment: A claim that a food is free of lactose. Note the amount that determines containment or lack of containment is based on target market regulations.
label: Lactose Free

LIGHT_LITE
type: Nutritional Claim Type Code
comment: A claim stating that a product is light or lite, and any claim likely to have the same meaning for the consumer, shall follow the same conditions as those set for the term reduced; the claim shall also be accompanied by an indication of the characteristic(s) which make the food light or lite.
label: Light or Lite

LOW_ENERGY
type: Nutritional Claim Type Code
comment: A claim that a food is low in energy, and any claim likely to have the same meaning for the consumer, may only be made where the product contains less than 40 kcal (170 kj)/100g and less than 20kcal (80kj)/100ml. In the case of foods naturally low in energy, the term naturally may be used as a prefix to this claim.
label: Low Energy

LOW_FAT
type: Nutritional Claim Type Code
comment: A claim that a food is low in fat, and any claim likely to have the same meaning for the consumer, may only be made where the product contains no more than 3g of fat per 100g or 1.5g of fat per 100ml. In the case of foods naturally low in fat, the term naturally may be used as a prefix to this claim.
label: Low in Fat

LOW_LACTOSE
type: Nutritional Claim Type Code
comment: A claim that a food is low in lactose. Note the amount that determines containment or lack of containment is based on target market regulations.
label: Low in Lactose

LOW_PROTEIN
type: Nutritional Claim Type Code
comment: A claim that a food contains low levels of protein. Note the amount that determines containment or lack of containment is based on target market regulations.
label: Low Protein

LOW_SATURATED_FAT
type: Nutritional Claim Type Code
comment: A claim that a food is low in saturated fat, and any claim likely to have the same meaning for the consumer, may only be made where the product contains no more than 1.5g of saturates per 100g for solids or, 0.75g of saturates per 100ml for liquids and in either case saturated fat must not provide more than 10% of energy. In the case of foods naturally low in saturated fat, the term naturally may be used as a prefix to this claim.
label: Low in Saturated Fat

LOW_SODIUM_SALT
type: Nutritional Claim Type Code
comment: A claim that a food is low in sodium, and any claim likely to have the same meaning for the consumer, may only be made where the product contains no more than 0.12g of sodium, or the equivalent value for salt, per 100g or per 100ml. In the case of foods naturally low in sodium, the term naturally may be used as a prefix to this claim.
label: Low in Sodium

LOW_SUGARS
type: Nutritional Claim Type Code
comment: A claim that a food is low in sugars, and any claim likely to have the same meaning for the consumer, may only be made where the product contains no more than 5g of sugars per 100g or 100ml. In the case of foods naturally low in sugars, the term naturally may be used as a prefix to this claim.
label: Low in sugars

MILK_FREE
type: Nutritional Claim Type Code
comment: A claim that a food is free from milk. Note the amount that determines containment or lack of containment is based on target market regulations.
label: Milk Free

MILK_PROTEIN_FREE
type: Nutritional Claim Type Code
comment: A claim that a food is free from milk proteins. Note the amount that determines containment or lack of containment is based on target market regulations.
label: Milk Protein Free

NATURAL_SOURCE_OF_VITAMINS_AND_OR_MINERALS
type: Nutritional Claim Type Code
comment: A claim that a food is a natural source of vitamins and/or minerals, and any claim likely to have the same meaning for the consumer, may only be made where the product contains at least 15% of the recommended daily allowance specified in the Annex of Council Directive 90/496/EEC per 100 g or 100 ml.
label: Natural Source of Vitamins Minerals

NON_ALCOHOLIC
type: Nutritional Claim Type Code
comment: A claim that a food contains no alcohol. Note the amount that determines containment or lack of containment is based on target market regulations.
label: Non-alcoholic

NUT_FREE
type: Nutritional Claim Type Code
comment: A claim that a food is free from nuts. Note the amount that determines containment or lack of containment is based on target market regulations.
label: Nut Free

PEANUT_FREE
type: Nutritional Claim Type Code
comment: A claim that a food is free from peanuts. Note the amount that determines containment or lack of containment is based on target market regulations.
label: Peanut Free

PRESERVATIVE_FREE
type: Nutritional Claim Type Code
comment: A claim that a food is free from preservatives. A preservative is a natural or synthetic substance or chemical that is added to products to prevent decomposition by microbial growth or by undesirable chemical changes. Note the amount that determines containment or lack of containment is based on target market regulations.
label: Preservative Free

SATURATED_FAT_FREE
type: Nutritional Claim Type Code
comment: A claim that a food does not contain saturated fat, and any claim likely to have the same meaning for the consumer, may only be made where the product contains no more than 0.1g of saturated fat per 100g or 100ml. In the case of foods naturally saturated fat-free, the term naturally may be used as a prefix to this claim.
label: Saturated Fat Free

SODIUM_FREE_OR_SALT_FREE
type: Nutritional Claim Type Code
comment: A claim that a food is sodium-free, and any claim likely to have the same meaning for the consumer, may only be made where the product contains no more than 0.005g of sodium, or the equivalent value for salt, per 100g. In the case of foods naturally sodium-free, the term naturally may be used as a prefix to this claim.
label: Sodium of Salt Free

SOURCE_OF_FIBRE
type: Nutritional Claim Type Code
comment: A claim that a food is a source of fibre, and any claim likely to have the same meaning for the consumer, may only be made where the product contains at least 3g of fibre per 100g or at least 1.5g of fibre per 100kcal. In the case of foods that are naturally sources of fibre, the term naturally may be used as a prefix to this claim.
label: Source of Fibre

SOURCE_OF_PROTEIN
type: Nutritional Claim Type Code
comment: A claim that a food is a source of protein, and any claim likely to have the same meaning for the consumer, may only be made where at least 12% of the energy value of the food is provided by protein. In the case of foods that are naturally sources of protein, the term naturally may be used as a prefix to this claim.
label: Source of Protein

SOY_FREE
type: Nutritional Claim Type Code
comment: A claim that a food is free from Soy. Note the amount that determines containment or lack of containment is based on target market regulations.
label: Soy Free

STRONGLY_SALTED
type: Nutritional Claim Type Code
comment: A claim that a food has a high sodium content. Note the amount that determines containment or lack of containment is based on target market regulations.
label: Strongly Salted

SUGARS_FREE
type: Nutritional Claim Type Code
comment: A claim that a food is sugars-free, and any claim likely to have the same meaning for the consumer, may only be made where the product contains no more than 0.5g of sugars per 100g or 100ml. In the case of foods naturally sugars-free, the term naturally may be used as a prefix to this claim.
label: Sugar Free

SWEETENED_WITH_AGAVE_SYRUP
type: Nutritional Claim Type Code
comment: A claim that a food is sweetened with syrup from the Agave plant.
label: Sweetened With Agave Syrup

SWEETENED_WITH_CANE_SUGAR
type: Nutritional Claim Type Code
comment: A claim that a food is sweetened with sugar from sugar cane.
label: Sweetened With Came Sugar

SWEETENED_WITH_CORN_SYRUP
type: Nutritional Claim Type Code
comment: A claim that a food is sweetened with corn syrup.
label: Sweetened With Corn Syrup

SWEETENED_WITH_FRUCTOSE
type: Nutritional Claim Type Code
comment: A claim that a food is sweetened with fructose.
label: Sweetened With Fructose

SWEETENED_WITH_FRUIT_JUICE
type: Nutritional Claim Type Code
comment: A claim that a food is sweetened with fruit juice.
label: Sweetened With Fruit Juice

SWEETENED_WITH_FRUIT_SYRUP
type: Nutritional Claim Type Code
comment: A claim that a food is sweetened with fruit syrup. Fruit syrup is made from fruit and other ingredients such as sugar, corn syrup and water.
label: Sweetened With Fruit Syrup

SWEETENED_WITH_HONEY
type: Nutritional Claim Type Code
comment: A claim that a food is sweetened with honey.
label: Sweetened With Honey

SWEETENED_WITH_MALT
type: Nutritional Claim Type Code
comment: A claim that a food is sweetened with malt.
label: Sweetened With Malt

SWEETENED_WITH_RAW_BEET_SUGAR
type: Nutritional Claim Type Code
comment: A claim that a food is sweetened with raw sugar derived from the sugar beet.
label: Sweetened With Raw Beet Sugar

SWEETENED_WITH_WHITE_SUGAR
type: Nutritional Claim Type Code
comment: A claim that a food is sweetened with white sugar. White or granulated sugar is refined sugar (pure white crystalline sucrose) ground to granules or grains.
label: Sweetened With White Sugar

VERY_LOW_GLUTEN
type: Nutritional Claim Type Code
comment: A claim that a food contains a low level of gluten which is defined as 21 - 100 mg/kg gluten according to the Commission Regulation (EC) No 41/2009
label: Very Low Gluten

VERY_LOW_SODIUM_SALT
type: Nutritional Claim Type Code
comment: A claim that a food is very low in sodium, and any claim likely to have the same meaning for the consumer, may only be made where the product contains no more than 0.04g of sodium, or the equivalent value for salt, per 100g or per 100 ml. In the case of foods naturally very low in sodium, the term naturally may be used as a prefix to this claim.
label: Very Low in Sodium Salt

WHEAT_FREE
type: Nutritional Claim Type Code
comment: A claim that a food is free from wheat. Note the amount that determines containment or lack of containment is based on target market regulations.
label: Wheat Free

WITH_NO_ADDED_SUGARS
type: Nutritional Claim Type Code
comment: A claim stating that sugar has not been added to a food, and any claim likely to have the same meaning for the consumer, may only be made where the product does not contain any added mono- or disaccharides or any other food used for its sweetening properties.
label: No Added Sugar

COUPON_CODE
type: Offer Redemption Type Code
comment: Offer available as a code that can be entered to redeem the coupon or voucher.
label: Coupon Code

GIFT_CARD
type: Offer Redemption Type Code
comment: A prepaid stored-value money card.
label: Gift Card

REBATE
type: Offer Redemption Type Code
comment: A partial refund upon purchase of a product.
label: Rebate

SALE
type: Offer Redemption Type Code
comment: Offer available as a reduced sales price on a product.
label: Sale

SINGLE_USE_CODE
type: Offer Redemption Type Code
comment: Offer available as a code that can be entered once to redeem the coupon.
label: Single Use Code

1
type: Organic Claim Agency Code
comment: EPA - US Environmental Protection Agency
label: EPA

10
type: Organic Claim Agency Code
comment: Demeter-Bund - The Demeter movement as an entrepreneurial network promotes the development of bio-dynamic economy, to secure the livelihoods of the world and to strengthen the positive people in his ministry. In cooperation contribute producers, processors, traders and consumers in partnership to shape the market.
label: Demeter-Bund

11
type: Organic Claim Agency Code
comment: GÄA is a diverse farming association for farmers, processors and traders inside.Focal point is Germany. GÄA is a special design for the structure of the organic farming. Biokreis- The Biokreis is an association for organic farming. Currently more than 800 farms, 80 and 200 processors, consumers are members of Biokreis, committed to working together on more than 33,000 for organic and sustainable farming.
label: GÄA

12
type: Organic Claim Agency Code
comment: Naturland - Naturland is active the world over in promoting organic agriculture. Its members are farmers who produce a wide range of valuable products: coffee from Mexico and Peru, olive oil from Greece, tea from the slopes of India's mountains, pineapple and other tropical fruit from Uganda, spices from Sri Lanka. Organic agriculture safeguards the existence of smallholders and helps with the sustainable management of what are often fragile ecosystems. On a global scale, over 50,000 Naturland farmers are cultivating an area of over 142,000 hectares.
label: Naturland

13
type: Organic Claim Agency Code
comment: Biopark - Biopark is an organic farmers' association based in the North of Germany, in Mecklenburg-Vorpommerania.
label: Biopark

14
type: Organic Claim Agency Code
comment: Ecovin - ECOVIN Federation Organic Viticulture Association: ECOVIN largest merger in 1985 as ecologically-working wine estates in Germany was founded. Approximately 220 member companies currently manage 1,600 hectares of vineyards in 11 German wine-growing areas.
label: Ecovin

15
type: Organic Claim Agency Code
comment: IFOAM - The International Federation of Organic Agriculture Movements (IFOAM) is a grassroots and democratic organisation that currently unites 750 member organisations in 116 countries. Note: this value will be deleted in the future and should not be used.
label: IFOAM

16
type: Organic Claim Agency Code
comment: Demeter International Demeter-International e. V. is a non profit organisation and its member organisations work together in the spirit of an international confederation with democratic principles. Membership requires a functioning Demeter certification programme.
label: Demeter International

17
type: Organic Claim Agency Code
comment: Bioland: The leading organic farmers' association in Germany for the economy of organic-based businesses without synthetic pesticides and synthetic chemical nitrogen fertilizer. The animals are kept humanely and processed food carefully. This provides an environmentally sound and sustainable food production. http://www.bioland.de.
label: Bioland

19
type: Organic Claim Agency Code
comment: Quality Certification Services. Note: this value will be deleted in the future and should not be used.
label: QCS

2
type: Organic Claim Agency Code
comment: FSA - UK Food Standards Agency
label: FSA

20
type: Organic Claim Agency Code
comment: Washington State Dept. of Agriculture. Note: this value will be deleted in the future and should not be used.
label: WSDA

21
type: Organic Claim Agency Code
comment: The Canada Organic Regime is the Government of Canada's response to requests by the organic sector and consumers to develop a regulated system for organic agricultural products. The Organic Products Regulations define specific requirements for organic products to be labelled as organic or that bear the Canada Organic logo. URL: http://www.inspection.gc.ca/food/organic-products/labelling-and-general-information/certified-choice/eng/1328082717777/1328082783032
label: CFIA - Organic Regime

22
type: Organic Claim Agency Code
comment: The European Union Commission.
label: EU Commission

23
type: Organic Claim Agency Code
comment: OISCC - The Organic Industry Standards and Certification Council maintains the Australian National Standard for Organic and Biodynamic Produce, to ensure continued consumer confidence and International market access.
label: The Organic Industry Standards and Certification Council (OISCC)

24
type: Organic Claim Agency Code
comment: ACO - Australian Certified Organic is Australia's largest certifier for organic and biodynamic produce and has over 1500 operators within its certification system. ACO is a not for profit fully-owned subsidiary of Australia Organic Ltd.
label: Australian Certified Organic (ACO)

25
type: Organic Claim Agency Code
comment: NASAA Certified Organic (NCO) is a fully-owned subsidiary of The National Association for Sustainable Agriculture, Australia who provides the certification services.
label: National Association for Sustainable Agriculture (NASAA)

26
type: Organic Claim Agency Code
comment: OFC - The Organic Food Chain provides certification services in accordance with the National Standard for Organic and Bio-Dynamic Produce and other international organic certification standards.
label: OFC

27
type: Organic Claim Agency Code
comment: AUS-QUAL is a certification body accredited by JAS-ANZ, providing conformity assessment services for quality management and food safety (HACCP) management systems, as well as Product Cortication Systems for the wider Australian and New Zealand agricultural, horticultural and secondary processing sectors.
label: AUS-QUAL

28
type: Organic Claim Agency Code
comment: The Bio-Dynamic Research Institute, founded in 1957, is involved in research and practical development of the Australian DEMETER Bio-Dynamic Method of Agriculture. In 1967 it was vested with the rights and supervision of the DEMETER Trademark in Australia. Part of this role is the certification of DEMETER quality products.
label: BDRI

29
type: Organic Claim Agency Code
comment: Safe Food Production Queensland works in partnership with the Department of Agriculture and Fisheries and Forestry (DAFF) and Queensland Health (QH) across the entire food chain, to ensure Queensland's food supply is safe.
label: SFQ

3
type: Organic Claim Agency Code
comment: FDA - US Food and Drug Agency
label: FDA

30
type: Organic Claim Agency Code
comment: The Danish Veterinary and Food Administration (DVFA) is part of the Ministry of Environment and Food. DVFA is responsible for food safety and health from farm to fork and maintains a list of Danish food companies, aquacultural farms etc. subject to organic inspection. Only authorities under the Ministry of Environment and Food carry out inspection under the government rules for organic production. The Danish AgriFish Agency inspects the primary production, while the Danish Veterinary and Food Administration (DVFA) inspects food companies.
label: Danish Veterinary and Food Administration (DVFA)

31
type: Organic Claim Agency Code
comment: Verbund Ökohöfe e.V. is an organic cultivation association based in Wanzleben in the Magdeburg Börde region
label: Ökohöfe

32
type: Organic Claim Agency Code
comment: The biolabel of the Bavarian State Ministry for Food, Agriculture and Forestry meets the wish of consumers for a high quality of organic products and traceable origin. Only those products whose organic quality standards extend far beyond the statutory regulations and originate from the stated regions are permitted to bear this quality seal. Try out convincing organic products yourself, safe in the knowledge of their place of origin.
label: Bayerisches Bio-Siegel

33
type: Organic Claim Agency Code
comment: The products marked with the bio-symbol Baden-Württemberg are regional organic foods with traceable origin. The use or labelling is based on the ecological standards of the EC eco-regulation supplemented by the requirement that the products have to be produced in fully converted farms and partly also to the stricter requirements of the ecological cultivation associations
label: Bio Baden-Württemberg

34
type: Organic Claim Agency Code
comment: The EKO Certification Foundation is an independent private foundation established in 2012. The foundation has no profit objective. The EKO label for foods has been around for 30 years, and most people know as a hallmark for organic foods. The EKO certificate has been the owner of this collective mark. With the advent of the European Ecolabel (the green leaf with the asterisks), EKO has been given the opportunity to develop further. Producers should be in addition to biologically certified, also carry out additional efforts in the area of sustainability.
label: Stichting EKO keurmerk

4
type: Organic Claim Agency Code
comment: International Foundation for Organic Agriculture
label: IFOA

5
type: Organic Claim Agency Code
comment: BFA - Biological Farmers of Australia
label: BFA

6
type: Organic Claim Agency Code
comment: USDA- US Department of Agriculture
label: USDA

7
type: Organic Claim Agency Code
comment: Quality Assurance International www.qai-inc.com QAI is a leading USDA-accredited organic product certifying agency. Note: this value will be deleted in the future and should not be used.
label: QAI

8
type: Organic Claim Agency Code
comment: Südtirol Bioland - Bioland Association of South Tyrol The Association of South Tyrol is the largest organic association for organic farmers having to farmers in South Tyrol and the only active in association with a national association office Terlan.Note: this value will be deleted in the future and should not be used.
label: Südtirol Bioland

9
type: Organic Claim Agency Code
comment: Ecoland - Ecoland is a membership organisation whose members elect a governing Board which is responsible for the design and implementation of the organic certification system.
label: Ecoland

999
type: Organic Claim Agency Code
comment: Unspecified Agency
label: Unspecified Agency

BFA
type: Organic Claim Agency Code
deprecated: 5
comment: Biological Farmers of Australia
label: Biological Farmers of Australia

BIOLAND
type: Organic Claim Agency Code
deprecated: 17
comment: Bioland: The leading organic farmers' association in Germany for the economy of organic-based businesses without synthetic pesticides and synthetic chemical nitrogen fertilizer. The animals are kept humanely and processed food carefully. This provides an environmentally sound and sustainable food production. http://www.bioland.de.
label: Bioland

DEMETER_BUND
type: Organic Claim Agency Code
deprecated: 10
comment: The Demeter movement as an entrepreneurial network promotes the development of bio-dynamic economy, to secure the livelihoods of the world and to strengthen the positive people in his ministry. In cooperation contribute producers, processors, traders and consumers in partnership to shape the market.
label: Demeter-Bund

DEMETER_INTERNATIONAL
type: Organic Claim Agency Code
deprecated: 16
comment: Demeter International Demeter-International e. V. is a non profit organisation and its member organisations work together in the spirit of an international confederation with democratic principles. Membership requires a functioning Demeter certification programme. Same as GS1 Code 16
label: Demeter International

ECOLAND
type: Organic Claim Agency Code
deprecated: 9
comment: Ecoland is a membership organisation whose members elect a governing Board which is responsible for the design and implementation of the organic certification system.
label: Ecoland

ECOVIN
type: Organic Claim Agency Code
deprecated: 14
comment: ECOVIN Federation Organic Viticulture Association: ECOVIN largest merger in 1985 as ecologically-working wine estates in Germany was founded. Approximately 220 member companies currently manage 1,600 hectares of vineyards in 11 German wine-growing areas. Same as GS1 code 14
label: Ecovin

EPA
type: Organic Claim Agency Code
deprecated: 1
comment: US Environmental Protection Agency. Same as GS1 Code 1
label: US Environmental Protection Agency

FDA
type: Organic Claim Agency Code
deprecated: 3
comment: FDA US Food and Drug Agency
label: FDA US Food and Drug Agency

FSA
type: Organic Claim Agency Code
deprecated: 2
comment: UK Food Standards Agency

GAA
type: Organic Claim Agency Code
deprecated: 11
comment: GAA is a diverse farming association for farmers, processors and traders inside.Focal point is Germany. GAA is a special design for the structure of the organic farming. Biokreis- The Biokreis is an association for organic farming. Currently more than 800 farms, 80 and 200 processors, consumers are members of Biokreis, committed to working together on more than 33,000 for organic and sustainable farming.

IFOA
type: Organic Claim Agency Code
deprecated: 4
comment: International Foundation for Organic Agriculture
label: International Foundation for Organic Agriculture

IFOAM
type: Organic Claim Agency Code
deprecated: 15
comment: The International Federation of Organic Agriculture Movements (IFOAM) is a grassroots and democratic organization that currently unites 750 member organizations in 116 countries. Same as GS1 code 15
label: International Federation of Organic Agriculture Movements.

NATURLAND
type: Organic Claim Agency Code
deprecated: 12
comment: Naturland - Naturland is active the world over in promoting organic agriculture. Its members are farmers who produce a wide range of valuable products: coffee from Mexico and Peru, olive oil from Greece, tea from the slopes of India's mountains, pineapple and other tropical fruit from Uganda, spices from Sri Lanka. Organic agriculture safeguards the existence of smallholders and helps with the sustainable management of what are often fragile ecosystems. On a global scale, over 50,000 Naturland farmers are cultivating an area of over 142,000 hectares.Same as GS1 Code 12
label: Naturland

QAI
type: Organic Claim Agency Code
deprecated: 7
comment: Quality Assurance International. QAI is a leading USDA-accredited organic product certifying agency.
label: Quality Assurance International

SUDITIROL
type: Organic Claim Agency Code
deprecated: 8
comment: Bioland Association of South Tyrol The Association of South Tyrol is the largest organic association for organic farmers having to farmers in South Tyrol and the only active in association with a national association office Terlan.
label: Sudtirol Bioland

USDA
type: Organic Claim Agency Code
deprecated: 6
comment: US Department of Agriculture.
label: US Department of Agriculture

AU_ABN
type: Organization ID Type
comment: The Australian Business Number is a unique 11-digit identifier issued by the Australian Business Register which is operated by the Australian Taxation Office.
label: Australian Business Number

AU_ACN
type: Organization ID Type
comment: An Australian Company Number is a unique identifier required by every company registered under Australia's Corporations Act 2001. The ACN is a nine-digit number issued by the Australian Securities & Investments Commission to every Australian company.
label: Australian Company Number

CRD_PARTNER_CODE
type: Organization ID Type
comment: The Central Reference File Database (CRD), formerly known as Central Repository Domain is a centralised database that stores Location Codes and Company Codes required by European regulation, and makes them available to users. CRD contains the following reference files: - List of Countries (ISO 3166) - The Location Reference File which uniquely identifies physical rail points (e.g. stations, customer sidings, loading places) containing the Location Code (which includes the Country Code) - The Partner Reference File uniquely identifies all rail actors who exchange information (Company Codes); Each company actor must have a unique Company Code assigned by UIC
label: Central Reference File Database (CRD) covers both Locations and Organisations. The Partner Reference File uniquely identifies all rail actors who exchange information (Company Codes). Rail context

CRN
type: Organization ID Type
comment: A company registration number is a unique combination of numbers and/or letters. The company registration number (also known as the company number, registration number or simply in its abbreviated form) is used to identify a company and verify that it is an entity registered within the national registry for companies or enterprises. This value is generic and is not associated to any specific region.
label: Company Registration Number (CRN)

DID
type: Organization ID Type
comment: A globally unique persistent identifier that does not require a centralized registration authority because it is generated and/or registered cryptographically. The generic format of a DID is defined in the DID Core specification [DID-CORE]. A specific DID scheme is defined in a DID method specification. Many (but not all) DID methods make use of distributed ledger technology (DLT) or some other form of decentralized network.
label: Decentralized identifier

DUNS
type: Organization ID Type
comment: Data Universal Numbering System. It is a nine-digit numbering system which uniquely identifies an individual business. The DUNS number is a nine-digit number issued by Dun & Bradstreet assigned to each business location in the D&B database having a unique, separate, and distinct operation for the purpose of identifying them. A DUNS number is also a way in which separate corporate entities, having no official relationship, can be branded as one by sharing one DUNS number among the affiliated comp

DUNS_PLUS_FOUR
type: Organization ID Type
comment: The DUNS+4 refers to the DUNS number assigned by Dun and Bradstreet, plus a 4-character suffix that is assigned by the vendor to establish additional Central Contractor Registration (CCR) database records for identifying alternative electronic funds transfer (EFT) accounts for the same vendor located at the same physical address. Dun and Bradstreet has no affiliation with the 4-character suffix.
label: DUNS+4

EORI
type: Organization ID Type
comment: Businesses and people wishing to trade with the EU must, use the EORI number as an identification number in all customs procedures when exchanging information with Customs - https://ec.europa.eu/taxation_customs/dds2/eos/eori_home.jsp?Lang=en
label: Economic Operators Registration and Identification number

EO_ID
type: Organization ID Type
comment: A type of identifier in the format of the invariant set of ISO646:1991 used in accordance with the EU Implementing Regulation 2018/574 to identify an economic operator.
label: Economic Operator Identifier

EU_VAT_IDENTIFICATION_NUMBER
type: Organization ID Type
comment: An identifier used to identify companies for value added tax purposes in the European Union. Link: https://ec.europa.eu/taxation_customs/vies/faqvies.do#item_11
label: EU VAT Identification Number

FR_RCS
type: Organization ID Type
comment: The RCS (Registre du commerce et des sociétés), otherwise known as the Greffe, is the registry for the company accounts and by-laws of all companies in France.
label: Registre du commerce et des sociétés

FR_SIREN
type: Organization ID Type
comment: The SIREN number, issued by Insee (the National Institute of Statistics and Economic Studies) is the unique identification number of each company. It is a number that allows each company to be identified by the administrations in France. The SIREN number also constitutes the first 9 digits of the SIRET number.
label: Système d'identification du répertoire des entreprises

IMO_COMPANY_NUMBER
type: Organization ID Type
comment: IMO registers all vessels subject to the SOLAS convention. IMO also records the Owner, Operator, Manager and Group Beneficial Owner. For that purpose they also record the Companies acting in these roles using the IMO Company Number
label: International Maritime Organisation (IMO) Company Number

LEI
type: Organization ID Type
comment: The Legal Entity Identifier (LEI) is a 20-character, alpha-numeric code based on the ISO 17442 standard developed by the International Organization for Standardization (ISO). It connects to key reference information that enables clear and unique identification of legal entities participating in financial transactions
label: Legal Entity Identifier (LEI)

NL_KVK_NUMBER
type: Organization ID Type
comment: When registering with the Netherlands Chamber of Commerce KVK, a business is listed in the Dutch Commercial Register or Handelsregister (HR) as it is called in the Netherlands. The businesses are then given a 8-digit KVK number. This number serves to prove an organisation is a registered business.
label: Kamer van Koophandel (KVK) number

NL_OIN_NUMBER
type: Organization ID Type
comment: The Organization Identification Number (OIN) is a unique number assigned to organizations by Logius, the digital government service of the Netherlands Ministry of the Interior and Kingdom Relations, to identify, authenticate and/or authorise themselves in digital messaging within and with the government.
label: Organisatie-identificatienummer (OIN number)

NZ_GST_NUMBER
type: Organization ID Type
comment: An identifier used to identify companies for goods and services tax purposes in New Zealand.
label: New Zealand GST Number

NZ_IRD_NUMBER
type: Organization ID Type
comment: An identifier used to identify companies for tax purposes in New Zealand.
label: New Zealand Inland Revenue Identification Number

ORG_FOR_INTERNAL_USE_1
type: Organization ID Type
comment: Identification used for internal mapping purposes.
label: Organization For Internal Use 1

ORG_FOR_INTERNAL_USE_10
type: Organization ID Type
comment: Identification used for internal mapping purposes.
label: Organization For Internal Use 10

ORG_FOR_INTERNAL_USE_2
type: Organization ID Type
comment: Identification used for internal mapping purposes.
label: Organization For Internal Use 2

ORG_FOR_INTERNAL_USE_3
type: Organization ID Type
comment: Identification used for internal mapping purposes.
label: Organization For Internal Use 3

ORG_FOR_INTERNAL_USE_4
type: Organization ID Type
comment: Identification used for internal mapping purposes.
label: Organization For Internal Use 4

ORG_FOR_INTERNAL_USE_5
type: Organization ID Type
comment: Identification used for internal mapping purposes.
label: Organization For Internal Use 5

ORG_FOR_INTERNAL_USE_6
type: Organization ID Type
comment: Identification used for internal mapping purposes.
label: Organization For Internal Use 6

ORG_FOR_INTERNAL_USE_7
type: Organization ID Type
comment: Identification used for internal mapping purposes.
label: Organization For Internal Use 7

ORG_FOR_INTERNAL_USE_8
type: Organization ID Type
comment: Identification used for internal mapping purposes.
label: Organization For Internal Use 8

ORG_FOR_INTERNAL_USE_9
type: Organization ID Type
comment: Identification used for internal mapping purposes.
label: Organization For Internal Use 9

PHYTOSANITARY_REGISTRATION_NUMBER
type: Organization ID Type
comment: Within the European Union, the phytosanitary registration number identifies an organisation responsible for introducing, or moving plants, plant products and other objects, for which a phytosanitary certificate or a plant passport is required to comply with EU regulation. A phytosanitary registration number is not the same as a phytosanitary certificate number, which identifies the certificate issued to the organisation exporting items subject to phytosanitary processes.
label: Phytosanitary registration number

TIN
type: Organization ID Type
comment: The taxpayer identification number (TIN) is an identifying number used for tax purposes in the United States and in other countries under the Common Reporting Standard. The unique identifier is assigned to the Account Holder by the tax administration in the Account Holder's jurisdiction of tax residence. It is a unique combination of letters and/or numbers used to identify an individual or entity for the purposes of administering the tax laws of that jurisdiction. In some countries where the TIN is not used a national identification number, national identity number, or national insurance number is used by the governments of countries as a means of tracking their citizens, permanent residents, and temporary residents for the purposes of work, taxation, government benefits, health care, and other governmentally related functions.
label: Taxpayer Identification Number

UK_CRN
type: Organization ID Type
comment: A company registration number is a unique combination of numbers and, in some cases, letters. The company registration number (also known as the company number, registration number or simply abbreviated to CRN) is used to identify a company and verify that it is an entity registered with Companies House (the executive agency of the British Government reponsible for providing registered company information to the public).
label: U.K. Company Registration Number

US_498_ID
type: Organization ID Type
comment: A Service Provider Identification Number (SPIN) is a unique nine-digit number assigned to service providers by USAC when an FCC Form 498 is filed. This number is also known as the service provider's 498 ID.
label: Service Provider and Billed Entity Identification Number (FCC Form 498 ID)

US_499_FILER_ID
type: Organization ID Type
comment: The FCC Form 499 Filer Database is an identification system for all interstate telecommunications carriers, all interconnected VoIP providers, and certain other providers of interstate telecommunications. The Universal Service Fund helps communities across the country afford telecommunications and advanced services.
label: 499 Filer ID

US_BEA_ID
type: Organization ID Type
comment: The BEA foreign direct investment identification number is assigned to a new U.S. affiliate after their initial report has been accepted by the BEA. Filed by mail or facsimile, initial reports are due within 30 days of the end of the quarter in which the U.S. entity became foreign owned.
label: BEA Foreign Direct Investment Identification Number

US_CAGE
type: Organization ID Type
comment: The Defense Logistics Agency (DLA) Commercial and Government Entity. A CAGE code is a five character alpha-numeric identifier assigned to entities located IN the United States and its territories
label: Commercial and Government Entity

US_CID
type: Organization ID Type
comment: A company identification number, or CID, is given to a company when it is formed and the articles of organization or incorporation are approved by the U.S. Secretary of State. The CID is an important step when establishing a new company as it acts as a way to track important company information.
label: Company Identifier (CID)

US_CRD
type: Organization ID Type
comment: Every stockbroker (registered representative) licensed to sell securities in the U.S. must have a CRD number, which is administered by the Financial Industry Regulatory Authority (FINRA).
label: Central Registration Depository (CRD) Numbers

US_DEA
type: Organization ID Type
comment: A DEA number (DEA Registration Number) is an identifier assigned to a health care provider (such as a physician, physician assistant, nurse practitioner, optometrist, podiatrist, dentist, or veterinarian) by the United States Drug Enforcement Administration allowing them to write prescriptions for controlled substances.
label: Drug Enforcement Administration (DEA) Number

US_DODAAC
type: Organization ID Type
comment: Is a six position code that uniquely identifies a Department of Defense unit, activity, or organization that has the authority to requisition, contract for, receive, have custody of, issue, or ship DoD assets, or fund/pay bills for materials and/or services.
label: Department of Defense Activity Address Code

US_EIN
type: Organization ID Type
comment: The U.S. Employer Identification Number, also known as the Federal Employer Identification Number or the Federal Tax Identification Number, is a unique nine-digit number assigned by the Internal Revenue Service to business entities operating in the United States for the purposes of identification.
label: Employer Identification Number (EIN)

US_EPA_ID
type: Organization ID Type
comment: This number, issued either by the U. S. Environmental Protection Agency (U.S. EPA ID Number), or by DTSC (California ID Number), identifies each handler of hazardous waste on hazardous waste manifests and other paperwork.
label: EPA Identification Number

US_FCC_FRN
type: Organization ID Type
comment: An FRN, or FCC registration number, is a 10-digit number that is assigned to a business or individual registering with the FCC. The FCC will use the FRN to determine if all of a registrant's fees have been paid.
label: FCC Registration Number (FRN)

US_FDIC
type: Organization ID Type
comment: The FDIC Certificate ID is a unique number assigned to each depository institution by the Federal Deposit Insurance Corporation (FDIC).
label: Federal Deposit Insurance Corporation (FDIC) Certificate Number

US_FHFA_ID
type: Organization ID Type
comment: FHFA ID number is the number assigned to a member by FHFA and used by FHFA and the Banks to identify a particular member.
label: FHFA ID Number

US_FMC_ID
type: Organization ID Type
comment: The Federal Maritime Commission (FMC) is a USA federal agency. The FMC is responsible for regulating USA ocean transportation to and from the USA. To buy or sell sea freight services to or from the USA, a company must be licensed or registered with the FMC.
label: FMC License Number

US_GIIN
type: Organization ID Type
comment: GIIN is an abbreviation of Global Intermediary Identification Number. The FATCA Registration System approves foreign financial institutions (FFI), financial institution (FI) branches, direct reporting non-financial foreign entities (NFFE), sponsoring entities, sponsored entities, and sponsored subsidiary branches.
label: Global Intermediary Identification Number (GIIN)

US_LAB_ID
type: Organization ID Type
comment: Code to identify CPSC-Accepted Testing Laboratories. Section 14(a)(3)(E) of the Consumer Product Safety (CPSC) Act, as amended, requires the Commission to maintain on its website an up-to-date list of entities that have been accredited to assess conformity with children's product safety rules.
label: U.S. Lab ID

US_LIC
type: Organization ID Type
comment: The assigned LIC identifies the registered company, not an individual product or device; it can be used across multiple product lines.
label: Labeler Identification code (LIC)

US_MFG_ID
type: Organization ID Type
comment: The United States Customs use the Manufacturer's Identification Number (MID) in the electronic data processing and monitoring of manufacturers. MID is an identifying reference number given to manufacturers that import products into the United States.
label: Manufacturer ID

US_MIC
type: Organization ID Type
comment: Domestic boat manufacturers are required by U.S. federal law to obtain a unique Manufacturer's Identification Code (MIC). The same applies to domestic importers of foreign built vessels. This code must be incorporated as the first three characters of all hull identification numbers assigned to boats of their production.
label: Manufacturer's Identification Code (MIC)

US_NPI
type: Organization ID Type
comment: The National Provider Identifier (NPI) is a Health Insurance Portability and Accountability Act (HIPAA) Administrative Simplification Standard. The NPI is a unique identification number for covered health care providers. The NPI is a 10-position, intelligence-free numeric identifier (10-digit number).
label: National Provider Identifier (NPI)

US_RN
type: Organization ID Type
comment: RN stands for Registered Identification Number. It is a number issued by the FTC to U.S. businesses that manufacture, import, distribute, or sell products covered by the Textile, Wool, and Fur Acts. Businesses can use this number on product labels instead of the company name.
label: Registered Identification Number (RN)

US_RSSD_ID
type: Organization ID Type
comment: The RSSD ID is a unique identifier assigned to financial institutions by the U.S. Federal Reserve.
label: Replication Server System Database ID (RSSD ID)

US_SCAC
type: Organization ID Type
comment: The Standard Carrier Alpha Code (SCAC) is a unique two-to-four-letter code used to identify transportation companies. SCAC codes can be obtained from the National Motor Freight Traffic Association (NMFTA), located in Alexandria, VA.
label: Standard Carrier Alpha Code (SCAC)

US_UEI
type: Organization ID Type
comment: Uniquely identify entities registered in the U.S. government System for Award Management (SAM)
label: Unique Entity Identifier (UEI)

ACCEPTING_PARTY
type: Organization Role Code
comment: Organization responsible for legally accepting goods or services at a physical location handled by a delivery party. The accepting process is part of a broader receiving process, focussed on preliminary checks of goods or services being delivered and occurs in the presence of the transport carrier. When physical goods are delivered, the accepting party will perform a visual check of the transport units (e.g., pallets) to identify any visual damages or defects, any discrepancies with the associated dispatch notice, and notify the transport carrier of any issues found, which can be challenged by the transport carrier if required. This process is defined by transport regulations, and if no issues are found, the goods are legally accepted, and transfer of ownership is completed (even if subject to further legal checks carried out by the checking party) and goods can proceed to checking and storing processes. An accepting party may be different to the party responsible for buying, ordering or paying for the goods or services. May also be different to the party responsible for physically receiving the goods on arrival or storing into inventory. For example, an accepting party may be a service provider to the buyer of goods, meaning goods may be accepted on behalf of the buyer, or prior to being taken over by the buyer.
label: Accepting Organization
term status: stable

ACCOUNTS_DEPARTMENT
type: Organization Role Code
comment: A business function or segment responsible for the preparation of financial statements, maintenance of general ledgers, payment of bills, preparation of customer bills, payroll, and other activities related to the management of finances within an organization. May also be known as a finance department.
label: Accounts Department
term status: stable

AGRICULTURAL_COOPERATIVE
type: Organization Role Code
comment: An agricultural cooperative, also known as a farmers' co-op, is a cooperative in which farmers pool their resources in certain areas of activity.
label: Agricultural Cooperative
term status: stable

AIRPORT_OPERATOR
type: Organization Role Code
comment: An organization or civil authority responsible for the oversight and management of all duties and processes within an airport, for example terminal operations, security, safety, communications, ground transportation and other activities related to the welfare of passengers, airlines, tenants and the general public.
label: Airport Operator
term status: stable

AREA_HEALTH_SERVICE
type: Organization Role Code
comment: A grouping of entities, usually hospitals and associated healthcare service providers, which are defined as an Area Health Service and based on distinct geographic areas as defined by the region or country. May also be known as a regional health organization.
label: Area Health Service
term status: stable

ARRIVING_GOODS_PARTY
type: Organization Role Code
comment: Organization responsible for physically receiving goods arriving at a physical location, where goods may be temporarily stored ahead of being legally accepted and formally checked. The arriving goods process, is the first part of a broader receiving process, focussed primarily on handling goods so they are prepared and ready for the subsequent accepting and checking processes. The arriving goods party may be different to an accepting or checking party as processes to legally accept a delivery, or to confirm receipt to inventory are not necessarily included.
label: Arriving Goods Organization
term status: stable

BILL_OF_LADING_RECIPIENT
type: Organization Role Code
comment: Organization that needs to receive the Bill of Lading document (abbreviated as BOL or B/L). A BOL is used by many actors in the transport and supply chain sector to serve three main functions: as a conclusive receipt to acknowledge that goods have been physically loaded to a transport carrier; as evidence of the terms for the contract of carriage; and as a document of title, which may be used to claim ownership of the goods described on the BOL. Some common examples of BOL recipients include the shipper handing over goods to the transport carrier at the point of origin, or the buyer of goods who can use the BOL to claim release of the goods from the transport carrier at the destination.
label: Bill of Lading Recipient
term status: stable

BILL_TO
type: Organization Role Code
comment: Organisation that needs to receive the Bill of Lading document (abbreviated as BOL or B/L). A BOL is used by many actors in the transport and supply chain sector to serve three main functions: as a conclusive receipt to acknowledge that goods have been physically loaded to a transport carrier; as evidence of the terms for the contract of carriage; and as a document of title, which may be used to claim ownership of the goods described on the BOL. Some common examples of BOL recipients include the shipper handing over goods to the transport carrier at the point of origin, or the buyer of goods who can use the BOL to claim release of the goods from the transport carrier at the destination.
label: Bill To
term status: unstable

BRANCH
type: Organization Role Code
comment: An organization segment, that operates in different locations or jurisdictions than its parent organization. A branch is an extension of an existing company and does not constitute a separate legal entity, unlike a subsidiary or sub-organization.
label: Branch
term status: stable

BRAND_OWNER
type: Organization Role Code
comment: An organization who provides any commodity under a registered brand name or label. A brand owner may sell their commodities directly to consumers, retailers or marketplaces; or they may simply provide the rights to their brand name, for example, for manufacturers to produce goods with their brand name, as contracted with a retailer.
label: Brand Owner
term status: stable

BREEDER
type: Organization Role Code
comment: An organization which breeds animals, including aquatic vertebrates such as fish, according to their genealogy, characteristics, and offspring. A breeder is responsible for facilitating reproduction and birthing processes for a specific species. Includes care and rearing activities, but does not include cross-breeding for new species.
label: Breeder
term status: stable

BROKER_AGENT
type: Organization Role Code
comment: A broker or agent acts as an intermediary between its clients and other actors in cases where the client cannot or will not interact directly with those other actors. The services of brokers and agents vary widely. Examples include buying/selling products or services, representation of their clients towards authorities, agencies or other actors in a specific geography etc.
label: Broker Agent
term status: stable

BUYER
type: Organization Role Code
comment: The organization purchasing goods or services, from a seller. May be different to the party responsible for ordering, receiving or accepting the goods or services.
label: Buyer
term status: stable

BUYERS_AGENT_REPRESENTATIVE
type: Organization Role Code
comment: Third party who arranged the purchase of merchandise on behalf of the actual buyer.
label: Buyers Agent Representative
term status: unstable

BUYING_DEPARTMENT
type: Organization Role Code
comment: A business function or segment responsible for acquiring goods and services for a business to operate, including the monitoring of supply chains and negotiating contracts with vendors. May also be known as a procurement or purchasing department.
label: Buying Department
term status: stable

CARRIER
type: Organization Role Code
deprecated: TRANSPORTATION_CARRIER
comment: A company, which physically transports goods from one place to another.
label: Carrier
term status: archaic

CENTRAL_PAYMENT_SERVICE
type: Organization Role Code
comment: Master of the conveyance. An organization providing central (or consolidated payment) services.
label: Central Payment Service
term status: unstable

CHECKING_PARTY
type: Organization Role Code
comment: Organization designated on behalf of a transport carrier, an agent or goods owner who is responsible for the detailed checks of goods being sent or received. For goods being sent (outbound deliveries), the checking process is part of a broader sending process and establishes the actual figures of a shipment or consignment, checking product codes, product condition, quantities, weight, volume and/or cubic measurements of goods or containers which are included in a transport or trade contract and on which charges will be based. For goods being received (inbound deliveries), the checking process is part of a broader receiving process, focussed on detailed verification of what has been delivered and accepted, to confirm the physical contents of the transport units matches the delivery advice. If there are any issues found, sometimes known as 'hidden vices', the checking party is responsible for notifying the relevant parties, within a designated time frame from the receipt date of the shipment. Unlike the preliminary checks carried out by the accepting party, the checking process occurs after the transport carrier has left the premises. A checking party may be different to the party responsible for buying, ordering or paying for the goods or services. May also be different to the party responsible for physically receiving the goods on arrival or storing into inventory. For example, a checking party may be a service provider to the buyer of goods, meaning goods may be checked on behalf of the buyer, or prior to being stored in inventory.
label: Checking Organization
term status: stable

CHECK_ORDER
type: Organization Role Code
comment: Organization to which the check will be ordered, when different from the beneficiary.
label: Check Order
term status: unstable

CLINICAL_TRIAL_SPONSOR
type: Organization Role Code
comment: A person, company, institution, group, or organization that oversees or pays for a clinical trial and collects and analyses the data.
label: Clinical Trial Sponsor
term status: stable

COMPLIANCE_AUTHORITY_OR_AGENCY
type: Organization Role Code
comment: An organization, which is generally part of a government, that is responsible for ensuring compliance of products or services with the requirements specified in laws or regulations. These authorities may certify one or more conformance assessment body(ies) to perform the activities required to check compliance.
label: Compliance Authority or Agency
term status: stable

CONFORMITY_ASSESSMENT_BODY
type: Organization Role Code
comment: An organization that performs third-party conformity assessment activities, including testing, certification and inspection.
label: Conformity Assessment Body
term status: stable

CONSIGNEE
type: Organization Role Code
comment: Organization who receives goods from another party. The consignee may take title/ownership of the goods upon delivery or they may have taken ownership earlier in the process based on international commercial terms (known as Incoterms) agreed between the buyer and seller of the goods. The party identified as the consignee is an important element in cross-border transportation procedures, such as customs clearance and payment of taxes, for example.
label: Consignee
term status: stable

CONSIGNOR
type: Organization Role Code
comment: Organization who dispatches goods to another party. The consignor will keep the title/ownership of the goods being transported and is legally liable until the goods are transferred to or paid for by the consignee or the final party.
label: Consignor
term status: stable

CONSOLIDATOR
type: Organization Role Code
comment: An organization or department that combines transport units into larger consignments for shipping. A consolidator is different to a packer who packs physical goods for transportation and sale. Is also different to a repacker, who combines various goods into a single pack for sale or shipping.
label: Consolidator
term status: stable

CONSUMER
type: Organization Role Code
comment: The end user of a product or a service.
label: Consumer
term status: unstable

CORPORATE_IDENTITY
type: Organization Role Code
comment: An organization that represents the identity of a commercial organization, commonly known as a holding or parent company, and links a number of other organizations or affiliated sub-organizations.
label: Corporate Identity
term status: stable

COUNTRY_ORGANIZATION
type: Organization Role Code
comment: An organization that operates and/or is responsible for processes, activities and operations within a specific country (or a small grouping of adjacent countries), under the structure of a multinational or global organization. A country organization may be a separate legal entity and considered as a sub-organization or subsidiary of a parent organization.
label: Country Organization
term status: stable

CUSTOMS
type: Organization Role Code
deprecated: CUSTOMS_AUTHORITY
comment: Identification of customs authority relevant to the transaction or shipment.
label: Customs
term status: archaic

CUSTOMS_AUTHORITY
type: Organization Role Code
comment: An organization, typically a government authority or agency commonly known as 'customs', who is responsible for the administration and enforcement of jurisdictional customs laws and regulations of a country or territory, for example collecting taxes on goods entering the country and preventing illicit goods from entering a country.
label: Customs Authority
term status: stable

CUSTOMS_BROKER
type: Organization Role Code
comment: An organization providing services for the preparation of documents and/or electronic submissions, the calculation of taxes, duties and excises on behalf of the client, and facilitating communication between the importer/exporter and governmental authorities.
label: Customs Broker
term status: stable

CUTTER
type: Organization Role Code
comment: One engaged in carving meat (In EANCOM as Meat Cutter).
label: Cutter
term status: unstable

DATA_CONSUMER
type: Organization Role Code
comment: The organization receiving data from other organizations in any format and through any type of data sharing or transfer mechanism.
label: Data Consumer
term status: stable

DATA_PROVIDER
type: Organization Role Code
comment: The organization providing data to other organizations in any format and through any type of data sharing or transfer mechanism.
label: Data Provider
term status: stable

DECLARANTS_AGENT_REPRESENTATIVE
type: Organization Role Code
comment: Any natural or legal person who makes a declaration to an official body on behalf of another natural or legal person, where legally permitted (CCC).
label: Declarants Agent Representative
term status: unstable

DELIVERY_PARTY
type: Organization Role Code
deprecated: DELIVERY_RECIPIENT_PARTY
comment: Organization to which goods are delivered.
label: Delivery Organization
term status: archaic

DELIVERY_RECIPIENT_PARTY
type: Organization Role Code
comment: Organization responsible for the physical location where goods or services are delivered by a transport carrier, and/or taken over by the buyer. The delivery recipient party may be different to the party responsible for buying, ordering, accepting or paying for the goods or services; may also be different to the party responsible for receiving consigned shipments between carriers. For example, a delivery recipient party may be a service provider to the buyer of goods, liaising with freight forwarders to confirm transportation of goods.
label: Delivery Recipient Organization
term status: stable

DESIGNER
type: Organization Role Code
comment: An organization who designs.
label: Designer
term status: unstable

DESPATCH_PARTY
type: Organization Role Code
deprecated: DISPATCH_PARTY
comment: Organization where goods are collected or taken over by the carrier.
label: Despatch Organization
term status: archaic

DISPATCH_PARTY
type: Organization Role Code
comment: Organization responsible for the physical location where goods may be collected or taken over by the transport carrier for dispatch. The dispatch party may be different to the party responsible for selling or receiving payment for the goods or services; and may also be different to the party responsible for consigning shipments between carriers. For example, a dispatch party may be a service provider to the seller of goods, liaising with a freight forwarder to arrange transportation of the goods.
label: Dispatch Organization
term status: stable

DISTRIBUTION_MANAGEMENT_ENTITY_PROVIDER
type: Organization Role Code
comment: Organization providing a Distribution Management Entity (DME) system that is used to manage the distribution and disposition of clinical supplies. In many cases, this is the interactive technology IRT system, portal, a set of tools or different databases used to share information during a clinical trial.
label: Distribution Management Entity Provider
term status: stable

DISTRIBUTOR
type: Organization Role Code
comment: An organization in the distribution channel or supply chain that is an intermediary between a producer or manufacturer of goods and a downstream entity such as a retailer or reseller, responsible for facilitating services within distribution processes.
label: Distributor
term status: stable

DOCK_DOOR
type: Organization Role Code
deprecated: DOCK
comment: A door or collection of doors where trucks or rail cars are loaded (shipping) or unloaded (receiving). Used to load or unload products for logistics.
label: Dock Door
term status: archaic

EMERGENCY_DEPARTMENT
type: Organization Role Code
comment: A department within a hospital organization that is responsible for providing emergency care to patients who require urgent medical attention.
label: Emergency Department
term status: stable

EMPTY_EQUIPMENT_DISPATCH_PARTY
type: Organization Role Code
comment: Organization from whose premises empty equipment will be or has been dispatched.
label: Empty Equipment Dispatch Organization
term status: unstable

EMPTY_EQUIPMENT_RETURN_PARTY
type: Organization Role Code
comment: Organization from whose premises empty equipment will be or has been returned.
label: Empty Equipment Return Organization
term status: unstable

EQUIPMENT_OWNER
type: Organization Role Code
comment: Owner of equipment (e.g.,container, etc.).
label: Equipment Owner
term status: unstable

EXPORTER
type: Organization Role Code
comment: An organization that sends goods or services to another country for sale. An exporter, or a customs clearing agent or other authorised person acting on behalf of the exporter, is responsible for making an export declaration. This may include a manufacturer, seller or other person. Within a Customs union, consignor may have the same meaning as exporter.
label: Exporter
term status: stable

E_TAILER
type: Organization Role Code
comment: A retailer offering a varied selection of goods or services through an online store (i.e., via electronic transactions on the internet) for purchase by consumers, without the presence of a physical store.
label: E-tailer
term status: stable

FACILITIES_MAINTENANCE_DEPARTMENT
type: Organization Role Code
comment: A business function or segment responsible for the regular upkeep and maintenance of equipment, machinery, furnishings as well as building structures and grounds of a physical location. May include, but not limited to, tasks such as cleaning, servicing, repairing, gardening, safety conformance checks and certifications etc.
label: Facilities Maintenance Department
term status: stable

FACTOR
type: Organization Role Code
comment: An organization that purchases financial receiving instruments e.g. invoices
label: Factor
term status: unstable

FARM_OPERATOR
type: Organization Role Code
comment: An organization who tends to plants and/or animals for the production of foodstuffs for eventual consumption (e.g., vegetables, meat or dairy), or livestock for labour or leisure purposes (e.g., work horse or pet).
label: Farm Operator
term status: stable

FATTENER
type: Organization Role Code
comment: The organization which fattens the animal.
label: Fattener
term status: unstable

FISHING_OPERATOR
type: Organization Role Code
comment: Organization who collects non-domesticated creatures from bodies of water for eventual consumption.
label: Fishing Operator
term status: stable

FOODSERVICE_DISTRIBUTOR
type: Organization Role Code
comment: Organization that provides food and non-food products to restaurants, cafeterias, industrial caterers, hospitals, schools/colleges/universities, nursing homes, and anywhere food is served away from the home.
label: Foodservice Distributor
term status: stable

FOODSERVICE_OPERATOR
type: Organization Role Code
comment: An organization which offers food and beverages to the public, either for purchase or as part of a service relationship with another party, for example for a private function.
label: Foodservice Operator
term status: stable

FREIGHT_FORWARDER
type: Organization Role Code
comment: An organization that organizes shipments for individuals or other organizations to transport goods from the collection of goods at a point of origin to a specified destination. Freight forwarders typically contract with transportation carriers to move goods.
label: Freight Forwarder
term status: stable

GOODS_OWNER
type: Organization Role Code
comment: The organization which owns the goods.
label: Goods Owner
term status: stable

GOVERNMENT_AGENCY
type: Organization Role Code
comment: A permanent or semi-permanent organization that may be established by a national or state government within a federal system, that is responsible for the oversight and administration of specific functions. For example the UK's Driver and Vehicle Licensing Agency (DVLA).
label: Government Agency
term status: stable

GOVERNMENT_DEPARTMENT_OR_MINISTRY
type: Organization Role Code
comment: An organization or department within a government body that manages a specific sector of public administration and may oversee other government agencies and organizations as part of a political portfolio. For example, the UK's Department for Transport (DfT), oversees the UK's Driver and Vehicle Licensing Agency (DVLA). Usually led by a high-ranking government official or politician such as a minister, secretary or commissioner and staffed with members of a non-political civil service to manage operations.
label: Government Department or Ministry
term status: stable

GROWER
type: Organization Role Code
comment: An organization which is responsible for the growth and/or production of plants and crops such as fruit and vegetable produce, ornamental plants and trees, medicinal or cooking herbs etc. This organization may or may not be a producer or packer.
label: Grower
term status: stable

HARVESTER
type: Organization Role Code
comment: Organization who collects ready for harvest foodstuffs from farms for utilization or consumption by subsequent parties.
label: Harvester
term status: stable

HEALTHCARE_PROVIDER
type: Organization Role Code
comment: An organization providing healthcare services for primary care, nursing care and speciality care and/or treatments. Includes specialized providers such as surgeons, midwives, therapists, dentists for example.
label: Healthcare Provider
term status: stable

HOSPITAL_ORGANIZATION
type: Organization Role Code
comment: A healthcare organization responsible for a hospital facility providing patient treatment with specialized medical and nursing staff, medical equipment and inpatient care facilities.
label: Hospital Organization
term status: stable

HOSPITAL_PHARMACY_OPERATOR
type: Organization Role Code
comment: An organization and individual legal entity engaged in the activities of ordering and dispensing medications for the treatment of patients within a hospital facility, often at the direction of or by working directly with physicians, nurses or other specialized healthcare providers. Differs to a retail pharmacy operator in a retail pharmacy, as hospital pharmacists require specific clinical training and qualifications to handle specialist activities such as formulating patient specific doses or medications, preparing intravenous (IV) compounds, for example.
label: Hospital Pharmacy Operator
term status: stable

IMPORTER
type: Organization Role Code
comment: Organization who makes - or on whose behalf a Customs clearing agent or other authorized person makes - an import declaration. This may include a person who has possession of the goods or to whom the goods are consigned.
label: Importer
term status: stable

INFORMATION_PROVIDER
type: Organization Role Code
comment: The organization providing the information contained in the document.
label: Information Provider
term status: unstable

INSURER
type: Organization Role Code
comment: A person or company offering insurance policies for premiums.
label: Insurer
term status: unstable

INTERMEDIARY_BANK
type: Organization Role Code
comment: A financial institution between the ordered bank and the beneficiary's bank.
label: Intermediary Bank
term status: unstable

INTERMEDIARY_BANK_1
type: Organization Role Code
comment: A financial institution between the ordered bank and the beneficiary's bank.
label: Intermediary Bank 1
term status: unstable

INTERMEDIARY_BANK_2
type: Organization Role Code
comment: A financial institution between the ordered bank and the beneficiary's bank.
label: Intermediary Bank 2
term status: unstable

INVENTORY_CONTROLLER
type: Organization Role Code
comment: To specifically identify the organisation in charge of inventory control.
label: Inventory Controller
term status: unstable

INVENTORY_REPORTING_PARTY
type: Organization Role Code
comment: Organization reporting inventory information.
label: Inventory Reporting Organization
term status: unstable

INVOICEE
type: Organization Role Code
comment: The organization to whom an invoice is issued, which may be different to the organization to whom the invoice is sent to for processing e.g., BILL_TO and INVOICE_MUST_BE_SENT_TO. May also be different to the party ordering, accepting, buying, or initiating payment for the goods or services.
label: Invoicee
term status: stable

ISSUER_OF_INVOICE
type: Organization Role Code
comment: The organization issuing an invoice. May be different to the party selling, dispatching, or receiving payment for the goods or services.
label: Issuer of Invoice
term status: stable

LOGISTICS_SERVICE_PROVIDER
type: Organization Role Code
comment: An umbrella term for an organization, which provides a combination of different logistics services for another organization, such as transportation, storage and handling, freight forwarding, packing and repacking etc. Commonly known as a third-party logistics service provider (3PL).
label: Logistics Service Provider
term status: stable

MANUFACTURER_OF_FINISHED_GOODS
type: Organization Role Code
comment: An organization that has final responsibility for producing the finished goods, components or finished goods from raw materials and/or by assembling other components or finished goods. Finished goods are considered complete and ready for use. Includes third-party manufacturers, known as contract manufacturers, who handle the full production operations on behalf of another organization.
label: Manufacturer of Finished Goods
term status: stable

MANUFACTURER_OF_GOODS
type: Organization Role Code
deprecated: MANUFACTURER_OF_FINISHED_GOODS
deprecated: MANUFACTURER_OF_UNFINISHED_GOODS
comment: Organization who manufactures the goods.
label: Manufacturer of Goods
term status: archaic

MANUFACTURER_OF_UNFINISHED_GOODS
type: Organization Role Code
comment: An organization that produces semi-finished goods, components or semi-finished goods from raw materials and/or by assembling other components or semi-finished goods. Semi-finished goods are not consumer-ready. Includes third-party manufacturers, known as contract manufacturers, who handle the full production operations on behalf of another organization.
label: Manufacturer of Unfinished Goods
term status: stable

MARKETING_DEPARTMENT
type: Organization Role Code
comment: A business function or segment responsible for promoting an organization's brand, products and/or services, through the planning, creating and monitoring of marketing activities such as for brand management, promotional material and campaigns , and website content and search optimisations.
label: Marketing Department
term status: stable

MARKETPLACE_OPERATOR
type: Organization Role Code
comment: Organization which provides an online platform specifically for independent sellers to offer a varied selection of products for purchase by consumers. May also operate as an e-tailer, if the marketplace operator's own brand(s) are also sold online.
label: Marketplace Operator
term status: stable

MARK_FOR
type: Organization Role Code
comment: The ultimate destination of a unit load or transport package of goods where the Ship-To is a different location.
label: Mark For
term status: unstable

MENTAL_HEALTH_SERVICE
type: Organization Role Code
comment: An organization providing mental health treatment and support services.
label: Mental Health Service
term status: stable

MESSAGE_FROM
type: Organization Role Code
comment: Organization where the message comes from.
label: Message From.
term status: unstable

MESSAGE_RECIPIENT
type: Organization Role Code
comment: Organization receiving the message.
label: Message Recipient
term status: unstable

MINCER
type: Organization Role Code
comment: One engaged in the cutting or chopping of meat into very small pieces
label: Mincer
term status: unstable

OPERATING_DIVISION
type: Organization Role Code
comment: An operational department or business segment of an organization, which may have multiple days and times of operation, which differs to other departments or the main organization.
label: Operating Division
term status: stable

OPERATOR
type: Organization Role Code
comment: An organization who operates a business establishment, or has specific capabilities to operate equipment, machinery or devices.
label: Operator
term status: stable

ORDERING_PARTY
type: Organization Role Code
comment: Organization responsible for ordering goods or services. The ordering party may be different to the party responsible for buying, accepting, receiving or paying for the goods or services; may also be different to the delivery party responsible receiving goods at a physical location. For example, an ordering party may be a service provider to the buyer of goods, meaning the goods are ordered on behalf of the buyer.
label: Ordering Organization
term status: stable

OWNER_OF_EQUIPMENT
type: Organization Role Code
comment: Organization who owns equipment.
label: Owner of equipment
term status: unstable

OWNER_OF_MEANS_OF_TRANSPORT
type: Organization Role Code
comment: An organization who owns the means of transport, which may be leased or loaned for use by a transportation carrier or service provider.
label: Owner of Means of Transport
term status: stable

PACKER
type: Organization Role Code
comment: An organization or department that packs physical goods for transportation and sale. A packer is different to a consolidator who combines transport units into larger consignments for shipping, and is also different to a repacker, who combines various goods into a single pack for sale or shipping.
label: Packer
term status: stable

PARTY_DECLARING_THE_VALUE_ADDED_TAX
type: Organization Role Code
comment: A code to identify the organization who is responsible for declaring the Value Added Tax (VAT) on the sale of goods or services.
label: Organization Declaring the Value Added Tax
term status: unstable

PARTY_FOR_WHOM_ITEM_IS_ULTIMATELY_INTENDED
type: Organization Role Code
comment: Party for whom item is ultimately intended.
label: Organization For Whom Item is Ultimately Intended
term status: unstable

PARTY_RECEIVING_PRIVATE_DATA
type: Organization Role Code
comment: The organization who is allowed access to master data information by the data owner when the data is viewed as private.
label: Organization Receiving Private Data
term status: unstable

PARTY_RECOVERING_THE_VALUE_ADDED_TAX
type: Organization Role Code
comment: A code to identify the organization who is eligible to recover the Value Added Tax (VAT) on the sale of goods or services.
label: Organization Recovering the Value Added Tax
term status: unstable

PARTY_TO_RECEIVE_ALL_DOCUMENTS
type: Organization Role Code
comment: An organization which is named to be the recipient of all documents.
label: Organization to Receive All Documents
term status: unstable

PARTY_TO_RECEIVE_COMMERCIAL_INVOICE
type: Organization Role Code
comment: Organization that needs to receive the commercial invoice. A commercial invoice is issued by a seller to the buyer of the goods or services and is often used as part of a customs declaration for foreign trade. It is needed for a wide range of services provided by actors in supply chain, transport and logistics processes, who are not involved in the buying and selling transaction covered by regular invoices.
label: Organization to Receive Commercial Invoice
term status: stable

PARTY_TO_RECEIVE_ELECTRONIC_MEMO_OF_INVOICE
type: Organization Role Code
comment: Organization that needs to receive notification for an invoice being issued, which may or may not be the same as the party identified as the invoice recipient, processor, or payer. For example, an external certification body, or a bank providing loans.
label: Organization to Receive Electronic Memo of Invoice
term status: stable

PARTY_TO_RECEIVE_FREIGHT_BILL
type: Organization Role Code
comment: Organization to whom the freight bill should be sent.
label: Organization to Receive Freight Bill
term status: unstable

PARTY_TO_RECEIVE_REFUND
type: Organization Role Code
comment: Organization to whom a refund is given.
label: Organization to Receive Refund
term status: unstable

PAYEE
type: Organization Role Code
comment: The organization receiving payment, and may be different to the party who sends the invoice, goods or services related to the payment.
label: Payee
term status: stable

PAYER
type: Organization Role Code
comment: The organization initiating payment, and may be different to the party who receives the invoice, goods or services related to the payment.
label: Payer
term status: stable

PHARMACY_OPERATOR
type: Organization Role Code
deprecated: RETAIL_PHARMACY_OPERATOR
comment: Organization engaged in the activities of ordering and dispensing medications for members of the public, often at the direction of physicians.
label: Pharmacy Operator
term status: archaic

PORT_OPERATOR
type: Organization Role Code
comment: An organization or civil authority responsible for the oversight and management of all duties and processes within a seaport or inland port, for example terminal operations, security, safety, communications, in-port transportation, vessel traffic services and other activities related to the welfare of passengers, shipping lines, tenants and the general public.
label: Port Operator
term status: stable

PRICE_LOCATION_PARTY
type: Organization Role Code
comment: An organization to which a price for a product is applicable. Within the context of GDSN Price Synchronization, it is also known as the 'Price Location' which is a GLN.
label: Price Location Organization
term status: unstable

PROXY
type: Organization Role Code
comment: A company that is selected by the Brand Owner to maintain their baseline attributes and Administrative Records in the GDSN.
label: Proxy
term status: unstable

PURCHASE_ORDER_RECEIVER
type: Organization Role Code
comment: The organization that receives the purchase order for the goods or services.
label: Purchase Order Receiver
term status: unstable

RECALL_RECIPIENT
type: Organization Role Code
comment: Organisation/Location/Individual receiving Recall notifications via local Recall Service.
label: Recall Recipient
term status: unstable

RECALL_SPONSOR
type: Organization Role Code
comment: Organisation sending Recall notifications via local Recall Service.
label: Recall Sponsor
term status: unstable

REGIONAL_ORGANIZATION
type: Organization Role Code
comment: An organization that operates and/or is responsible for processes, activities and operations within a specific geographical region and across a number of different countries, under the structure of a multinational or global organization. A regional organization may be a separate legal entity and considered as a sub-organization or subsidiary of a parent organization.
label: Regional Organization
term status: stable

REGISTERED_AGENT
type: Organization Role Code
comment: The organization having legal responsibility for the product in the target market for example a company to which market authorization has been issued.
label: Registered Agent
term status: unstable

REMIT_TO
type: Organization Role Code
comment: Organization to whom funds are directed for payment of a commercial invoice.
label: Remit To
term status: unstable

REPACKER
type: Organization Role Code
comment: Organization or department responsible for repacking goods for resale or for transportation purposes, without modifying the repacked products in any way. A repacker is different to packer who packs physical goods for transportation and sale; and is also different to a consolidator who combines transport units into larger consignments for shipping.
label: Repacker
term status: stable

RETAILER
type: Organization Role Code
comment: An organization who makes a varied selection of products available for purchase by consumers, either through operating physical or online stores.
label: Retailer
term status: stable

RETAIL_PHARMACY_OPERATOR
type: Organization Role Code
comment: An organization or individual legal entity engaged in the activities of ordering and dispensing medications for members of the public within a retail pharmacy, often at the direction of physicians. A retail pharmacy operator differs from a hospital pharmacy operator as they usually interact with the public to provide advice about their prescription, instead of working directly with healthcare specialists such as nurses and doctors to ensure the right medications are prescribed.
label: Retail Pharmacy Operator
term status: stable

SALES_DEPARTMENT
type: Organization Role Code
comment: A business function or segment responsible for selling goods and services to meet customer needs. Includes activities to increase profitability, forecasting and meeting sales targets, building and maintaining customer relationships, encouraging repeat purchases and brand loyalty.
label: Sales Department
term status: stable

SELLER
type: Organization Role Code
comment: The organization selling goods or services, to a buyer. May be different to the party responsible for dispatching the goods or services.
label: Seller
term status: stable

SERVICE_PROVIDER
type: Organization Role Code
comment: An organization providing services to another organization or directly to consumers. Some examples include (but are not limited to) consulting, advertising, legal, communications, transport, technology or processing services.
label: Service Provider
term status: stable

SHIPPER
type: Organization Role Code
comment: The party that initiates a contract for carriage with, and arranges for delivery of the goods to, a carrier or transport intermediary for transportation.
label: Shipper
term status: stable

SHIP_FROM
type: Organization Role Code
deprecated: SHIP_FROM_PARTY
comment: Organization from where goods will be or have been shipped.
label: Ship From
term status: archaic

SHIP_FROM_PARTY
type: Organization Role Code
comment: An organization which sends physical goods and invoices, and is often the same party as the consignor. However in some cases, a consignor may designate a third party to manage the facility where the goods are shipped from, which is different to the dispatch party responsible for the facility where the goods are dispatched from.
label: Ship From Organization
term status: stable

SHIP_TO
type: Organization Role Code
deprecated: SHIP_TO_PARTY
comment: Organization which receives goods and invoices.
label: Ship To
term status: archaic

SHIP_TO_PARTY
type: Organization Role Code
comment: An organization which receives physical goods and invoices, and is often the same party as the consignee. However in some cases, a consignee may designate a third party to manage the facility where the goods are shipped to, which is different to the delivery recipient party responsible for the facility where goods are received.
label: Ship To Organization
term status: stable

SLAUGHTERER
type: Organization Role Code
comment: An organization which is responsible for slaughtering livestock and preparing carcasses for further processing, including specialized tasks such as the removal of organs, hides and/or specific premium cuts.
label: Slaughterer
term status: stable

STORAGE_AND_HANDLING
type: Organization Role Code
deprecated: STORAGE_AND_HANDLING_PARTY
comment: The movement, protection, storage of products throughout manufacturing, warehousing and distribution
label: Storage and Handling
term status: archaic

STORAGE_AND_HANDLING_PARTY
type: Organization Role Code
comment: An organization or department responsible for the storage and handling of goods within a facility; may be included with other services offered by a logistics service provider or a leased warehouse space for example and is often a third party, that is external to the parties directly employed by the facility.
label: Storage and Handling Organization
term status: stable

SUBSTITUTE_SUPPLIER
type: Organization Role Code
comment: Organization which may be in a position to supply products or services should the main usual supplier be unable to do so.
label: Substitute Supplier
term status: unstable

SUPPLIER
type: Organization Role Code
comment: An organization that provides goods or services.
label: Supplier
term status: stable

SUPPLY_CHAIN
type: Organization Role Code
comment: A business function or segment responsible for the end-to-end process of manufacturing and trading commercial goods, with a broad scope covering procurement processes as well as traditional logistics processes involving warehousing and transportation
label: Supply Chain
term status: stable

TECHNICAL_SUPPORT_DEPARTMENT
type: Organization Role Code
comment: A business function or segment responsible for providing assistance and support for their organization's technical equipment and/or system infrastructure, for example with hardware such as computers, mobile phones and servers or software issues and configurations. Technical support may be provided as a service for internal staff or for external customers.
label: Technical Support Department
term status: stable

TRADER
type: Organization Role Code
deprecated: TRADER_FINANCIAL
comment: An organisation that engages in the buying and selling of financial assets in any financial market, either for themself or on behalf of another person or institution.
label: Trader
term status: archaic

TRADER_FINANCIAL
type: Organization Role Code
comment: An organization that engages in the buying and selling of financial assets in any financial market, either for themselves or on behalf of another person or institution.
label: Financial Trader
term status: stable

TRADER_GOODS
type: Organization Role Code
comment: An organization that engages in the buying and selling of tangible goods such as raw materials and fresh produce. Goods may be traded in any market, either for themselves or on behalf of another party.
label: Goods Trader
term status: stable

TRANSPORTATION_CARRIER
type: Organization Role Code
comment: An organization that undertakes or arranges the physical transportation of goods from one identified place to another. A transportation carrier is usually contracted by a freight forwarder to move goods within a regular route, for a set rate.
label: Transportation Carrier
term status: stable

WAREHOUSE_KEEPER
type: Organization Role Code
comment: Organization who is responsible for a warehouse location and the goods that are kept on-site within the facility.
label: Warehouse Keeper
term status: stable

WHOLESALER
type: Organization Role Code
comment: An organization that sells products, often in large quantities, to be retailed by others.
label: Wholesaler
term status: stable

BASE
type: Packaging Feature Code
comment: A general term applied to the support or pedestal of an object.
label: Base

BEAM
type: Packaging Feature Code
comment: Long sturdy piece of squared timber or metal used in house-building etc.
label: Beam

BUNG_SEAL
type: Packaging Feature Code
comment: A bung is an apparatus used to seal a container, such as a bottle, barrel or tubes. A bung is partially inserted inside the container to act as a seal. The most common every-day example of a bung is the stopper of a wine bottle.
label: Bung Seal

CAP
type: Packaging Feature Code
comment: A cap that seals a bottle or other form of packaging.
label: Cap

CARRIER
type: Packaging Feature Code
comment: A device of various types attached to or hung from trolleys to support the load.
label: Carrier

CONSUMPTION_UTENSIL
type: Packaging Feature Code
comment: An item which allows the user to extract and/or consume the content of a container.
label: Consumption Utensil

CORE
type: Packaging Feature Code
comment: A tubular shape around which flexible material such as plastic film or paper are wound for purposes of transport and handling.
label: Core

CREEL
type: Packaging Feature Code
comment: A creel is a device for holding the required number of roving spools or other supply packages of reinforcement fibers for Fiber Reinforced Plastics manufacturing. This device holds the rovings in the desired position for unwinding in continuous processes like Pultrusion and Filament Winding.
label: Creel

EDGE_PROTECTION
type: Packaging Feature Code
comment: A right-angle piece placed over the outermost perimeter edges of a container to distribute pressure and prevent collapse or cutting from banding, strapping, or handling.
label: Edge Protection

HANDLE
type: Packaging Feature Code
comment: A grip attached to an object for using or moving the object, usually with the hands.
label: Handle

INNER_CONTAINER
type: Packaging Feature Code
comment: Inner Container
label: Inner Container

INTERNAL_DIVIDER
type: Packaging Feature Code
comment: An internal divider is an object, either flat or custom-shaped, used to separate the content of a container or to prevent the content from mixing.
label: Internal Divider

LABEL
type: Packaging Feature Code
comment: A label is a piece of paper, polymer, cloth, metal, or other material affixed to a container or article (or printed directly upon it), which usually carries information about the article to.which it has been attached.
label: Label

LID
type: Packaging Feature Code
comment: In packaging, the top or bottom of a container, usually the part that closes the opening; may also be known as cap, over, or top
label: Lid

LINER
type: Packaging Feature Code
comment: An internal chamber within a container which separates the content of the container from the walls. Inner liners provide additional isolation and protection to the content of a container. Sometimes coatings of certain materials may be applied as an alternative to inner liners.
label: Liner

LUG
type: Packaging Feature Code
comment: A small indentation or raised portion on the surface of a bottle, provided as an indexing means for operations such as multi-pass decoration or labeling.
label: Lug

NESTING_EDGE
type: Packaging Feature Code
comment: Edges which allow items of the same size to be partially stacked within one another in any direction thus reducing the space required in order to stack them.
label: Nesting Edge

PEG
type: Packaging Feature Code
comment: A fastener which allows a product to be hanged.
label: Peg

PULL_OFF_TAB
type: Packaging Feature Code
comment: A flexible cover which can be easily removed in order to open a container.
label: Pull Off Tab

RING_HOLDER
type: Packaging Feature Code
comment: A hollow circular band of material wound around itself.
label: Ring Holder

RIVET
type: Packaging Feature Code
comment: A permanent fastener which consists of a cylindrical shaft with a head on one end and tail which is deformed to fixate the rivet in place.
label: Rivet

SLEEVE
type: Packaging Feature Code
comment: A tubular form, open at both ends, that is slipped over an item or package.
label: Sleeve

SPOUT
type: Packaging Feature Code
comment: A spout is a protruding edge which allows the lifting and pouring of liquids contained within a container.
label: Spout

TAG
type: Packaging Feature Code
comment: A hanging card made of any material which is used to identify or provide additional information of a product.
label: Tag

WICKER_OUTER_CONTAINER
type: Packaging Feature Code
comment: An outer container made of wicker which is fitted to the bottle usually a little less than half way up from the bottom of the bottle and is used to hold, hang or support the bottle.
label: Wicker Outer Container

WRAP
type: Packaging Feature Code
comment: A layer of any material which completely enclose a product. A wrap can have many purposes, from providing additional protection to an item to serving as a gift-wrap.
label: Wrap

ANTISEPTIC
type: Packaging Function Code
comment: The process by which a sterile (aseptic) product (typically food or pharmaceutical) is packaged in a sterile container in a way which maintains sterility.
label: Antiseptic

ANTI_TAMPERING
type: Packaging Function Code
comment: A methodology used to hinder, or deter unauthorized access to a device.
label: Anti-tampering

COATED
type: Packaging Function Code
comment: Covered with a material (paraffin, wax) that protects the product or packaging.
label: Coated

COMPRESSED
type: Packaging Function Code
comment: Content has been pressed together to the maximum possible way.
label: Compressed

DISPENSER
type: Packaging Function Code
comment: A device or mechanism to supply or extract contents.
label: Dispenser

GIFT_WRAPPED
type: Packaging Function Code
comment: Packaging is wrapped in a decorative way for the purposes of the consumer giving it as a gift.
label: Gift Wrapped

ISOTHERMIC
type: Packaging Function Code
comment: Thermal carry container designed for the carriage of temperature controlled goods such as vaccines, pharmaceuticals, and medicines.
label: Isothermic

MODIFIED_ATMOSPHERE
type: Packaging Function Code
comment: The practice of modifying the composition of the internal atmosphere of a package, (commonly food packages, and drugs) in order to improve the shelf life.
label: Modified Atmosphere

OXYGEN_INFUSED
type: Packaging Function Code
comment: A barrier packaging material for an infusion solution, i.e., oxygen.
label: Oxygen Infused

PEEL_OFF
type: Packaging Function Code
comment: A section of the packaging can be detached with ease in order to have access to the content or product, e.g. peel-off Lids used for packing Milk, Coffee and Cacao Powder.
label: Peel Off

PINPACK
type: Packaging Function Code
comment: The package is equipped to be hung up on a hook.
label: Pinpack

PROTECTED
type: Packaging Function Code
comment: Functionality to keep from being damaged, attacked, stolen, or injured; guard.
label: Protected

REINFORCED
type: Packaging Function Code
comment: A component is added to a container for a particular application to lend additional support under severe applications.
label: Reinforced

SIFT_PROOF
type: Packaging Function Code
comment: Packaging is designed to prevent leaking of the content specially when it is on powdered or liquid state.
label: Sift Proof

TAMPER_EVIDENT
type: Packaging Function Code
comment: The packaging is designed to show when there has been some interference with the original sealing or configuration of the packaging.
label: Tamper Evident

WATER_RESISTANT
type: Packaging Function Code
comment: Coated with materials that make the packaging impervious to the effects of water.
label: Water Resistant

APPROVED_BY_ASTHMA_AND_ALLERGY_ASSOC
type: Packaging Marked Diet Allergen Code
comment: Definitions made by the asthma and allergist association.
label: Asthma and Allergist Association

APPROVED_FOR_TUBE_FEEDING
type: Packaging Marked Diet Allergen Code
comment: The item is physically marked that it is approved for tube feeding by the appropriate authority of the target market.
label: Approved for Tube Feeding

BIOLOGICAL
type: Packaging Marked Diet Allergen Code
comment: Indicates the product has been marked as a biological item which indicates a food product that was produced with the use of feed or fertilizer of plant or animal origin, without employment of chemically formulated fertilizers, growth stimulants, antibiotics or pesticides.
label: Biological

CALORIES_PER_PORTION
type: Packaging Marked Diet Allergen Code
comment: Indicates the product has a marking with the calories per portion contained in the product.
label: Calories Per Portion

CONTAINS_LATEX
type: Packaging Marked Diet Allergen Code
comment: The item is physically marked as containing Latex (rubber).
label: Contains Latex

CONTAINS_PVC
type: Packaging Marked Diet Allergen Code
comment: The item is physically marked as containing PVC (Polyvinyl chloride). Phthalate content is unspecified.
label: Contains PVC

CONTAINS_PVC_WITHOUT_PHTHALATES
type: Packaging Marked Diet Allergen Code
comment: The item is physically marked as containing PVC (Polyvinyl chloride) without phthalates.
label: Contains PVC Without Phthalates

CONTAINS_PVC_WITH_PHTHALATES
type: Packaging Marked Diet Allergen Code
comment: The item is physically marked as containing PVC (Polyvinyl chloride) with phthalates.
label: Contains PVC With Phthalates

DIET_PRODUCT_450_800_KCAL_PER_DAY
type: Packaging Marked Diet Allergen Code
comment: The item is physically marked that it is approved for a 450-800 kilocalorie/day diet by the appropriate authority of the target market.
label: 450-800 Kilocalorie Per Day Diet

DIET_PRODUCT_800_1200_KCAL_PER_DAY
type: Packaging Marked Diet Allergen Code
comment: The item is physically marked that it is approved for a 800-1200 kilocalorie/day diet by the appropriate authority of the target market.
label: 800-1200 Kilocalorie Per Day Diet

GEZONDE_KEUZE_KLAVERTJE
type: Packaging Marked Diet Allergen Code
comment: Health symbol used in the Netherlands Target Market which indicates that the item is a cholesterol-reducing product.
label: Gezonde Keuze Klavertje

HALAL
type: Packaging Marked Diet Allergen Code
comment: Indicates the product has been marked as Halal which denotes selling or serving food ritually fit according to Islamic dietary laws.
label: Halal

IK_KIES_BEWUST
type: Packaging Marked Diet Allergen Code
comment: Conscious choice symbol used in the Netherlands Target Market which may be used for products low in saturated fat, trans fatty acids, sugar and salt.
label: Ik Kies Bewust

KOSHER
type: Packaging Marked Diet Allergen Code
comment: Indicates the product has been marked as Kosher which denotes selling or serving food ritually fit according to Jewish dietary laws.
label: Kosher

LACTASE_ENZYME
type: Packaging Marked Diet Allergen Code
comment: The item is physically marked that it is approved as lactase enzyme by the appropriate authority of the target market.
label: Lactase Enzyme

LOW_ON_PHENYLALANINE
type: Packaging Marked Diet Allergen Code
comment: The item is physically marked as containing a low level of phenylalanine as approved by the appropriate authority of the target market.
label: Low in Phenylalanine

LOW_ON_SUGAR
type: Packaging Marked Diet Allergen Code
comment: The item is physically marked as containing a low level of sugar as approved by the appropriate authority of the target market.
label: Low Sugar

MOTHERS_MILK_SUBSTITUTE
type: Packaging Marked Diet Allergen Code
comment: The item is physically marked that it is approved as substitute mother's milk the appropriate authority of the target market.
label: Mother's Milk Substitute

NUTRITION_SUPPLEMENT
type: Packaging Marked Diet Allergen Code
comment: The item is physically marked that it is approved as nutrition supplement by the appropriate authority of the target market.
label: Nutrition Supplement

NYCKELHAL_MARK
type: Packaging Marked Diet Allergen Code
comment: Lean product.
label: Nyckelhal Mark

VEGETARIAN
type: Packaging Marked Diet Allergen Code
comment: Indicates the product has been marked as vegetarian which denotes a product that contains no meat, fish or other animal products.
label: Vegetarian

FREE_FROM_ARTIFICIAL_COLOURING
type: Packaging Marked Free From Code
comment: The item is physically marked as having no artificial colouring.
label: Free From Artificial Colouring

FREE_FROM_ARTIFICIAL_FLAVOURING
type: Packaging Marked Free From Code
comment: The item is physically marked as having no artificial flavouring.
label: Free From Artificial Flavouring

FREE_FROM_ARTIFICIAL_PRESERVATIVES
type: Packaging Marked Free From Code
comment: The item is physically marked as having no artificial preservatives.
label: Free From Artificial Preservatives

FREE_FROM_CHOLESTEROL
type: Packaging Marked Free From Code
comment: The item is physically marked as having no Cholesterol.
label: Free From Cholesterol

FREE_FROM_CLONED_FOOD
type: Packaging Marked Free From Code
comment: The item is physically marked as being free from cloned food.
label: Free From Cloned Food

FREE_FROM_DAIRY
type: Packaging Marked Free From Code
comment: The item is physically marked as being free from dairy and dairy products, as approved by the appropriate authority of the target market.
label: Free From Dairy and Dairy Products

FREE_FROM_EGG
type: Packaging Marked Free From Code
comment: The item is physically marked as free from egg.
label: Free From Egg

FREE_FROM_FISH
type: Packaging Marked Free From Code
comment: The item is physically marked as being free from fish.
label: Free From Fish

FREE_FROM_GLUTEN
type: Packaging Marked Free From Code
comment: The item is physically marked as free from gluten. This level of containment is frequently determined through regulation.
label: Free From Gluten

FREE_FROM_LACTOSE
type: Packaging Marked Free From Code
comment: The item is physically marked as being free of lactose.
label: Free Of Lactose

FREE_FROM_LATEX
type: Packaging Marked Free From Code
comment: The item is physically marked being free from Latex (rubber).
label: Free From Latex

FREE_FROM_LEGUME_PROTEIN
type: Packaging Marked Free From Code
comment: The item is physically marked as being free from legume protein.
label: Free From Legume Protein

FREE_FROM_MILK
type: Packaging Marked Free From Code
comment: The item is physically marked as being free from milk and any of its derivatives.
label: Free From Milk

FREE_FROM_MILK_PROTEIN
type: Packaging Marked Free From Code
comment: The item is physically marked as being free from milk protein.
label: Free From Milk Protein

FREE_FROM_NATURAL_GLUTEN
type: Packaging Marked Free From Code
comment: The item is physically marked as being naturally free from gluten and not extracted as part of the manufacturing process.
label: Naturally Free From Gluten

FREE_FROM_PEANUTS
type: Packaging Marked Free From Code
comment: The item is physically marked as being free from peanuts.
label: Free From Peanuts

FREE_FROM_PROTEIN
type: Packaging Marked Free From Code
comment: The item is physically marked as being free from protein.
label: Free from Protein

FREE_FROM_PVC
type: Packaging Marked Free From Code
comment: The item is physically marked as being free from PVC (Polyvinyl chloride).
label: Free from PVC

FREE_FROM_SOYA
type: Packaging Marked Free From Code
comment: The item is physically marked as being free from soya.
label: Free From Soya

FREE_FROM_SUGAR
type: Packaging Marked Free From Code
comment: The item is physically marked as being free from sugar.
label: Free From Sugar

FREE_FROM_TRANSFAT
type: Packaging Marked Free From Code
comment: The item is physically marked being free from Trans Fatty Acids (Trans Fat)
label: Free from Trans Fatty Acids

REDUCED_LACTOSE
type: Packaging Marked Free From Code
comment: The item is physically marked as having a reduced amount of lactose
label: Reduced Amount of Lactose

REDUCED_PROTEIN
type: Packaging Marked Free From Code
comment: The item is physically marked as containing a low level of protein.
label: Low Level of Protein

REDUCED_TRANSFAT
type: Packaging Marked Free From Code
comment: The item is physically marked as having a reduced amount of transfats (unsaturated).
label: Reduced Amount of Transfats

VERY_LOW_GLUTEN
type: Packaging Marked Free From Code
comment: The item is physically marked as a very low amount of gluten. Very low is frequently determined through regulation for example, per EU Regulation (EC) No 41/2009 [of 20 January 2009], this is defined as containing between 20 and 100 mg/kg).
label: Very Low Amount of Gluten

WITHOUT_ADDED_SALT
type: Packaging Marked Free From Code
comment: The item is physically marked that no salt has been added when manufacturing the product but it still can contain salt that is naturally part of the ingredients, as approved by the appropriate authority of the target market.
label: Without Added Salt

WITHOUT_ADDED_SUGAR
type: Packaging Marked Free From Code
comment: The item is physically marked that no sugar has been added when manufacturing the product but it still can contain sugars that are naturally part of the ingredients, as approved by the appropriate authority of the target market.
label: Without Added Sugar

WITHOUT_ADDED_SWEETENER
type: Packaging Marked Free From Code
comment: The item is physically marked that no sweetener has been added when manufacturing the product.
label: Without Added Sweetener

AMA_ORGANIC_SEAL
type: Packaging Marked Label Accreditation Code
comment: Austria Ministry of Agriculture Organic Label, AMA Marketing licenses the AMA organic logo. Red, white and black indicates the majority of ingredients are of Austrian origin.
label: Austria Ministry of Agriculture Organic Label

AUS_KAUP_ESTONIA
type: Packaging Marked Label Accreditation Code
comment: Used to specify Estonia Meat in their product.
label: Aus Kaup Estonia

BDIH_LOGO
type: Packaging Marked Label Accreditation Code
label: BDIH Germany guidelines for Certified Natural Cosmetics

BETER_LEVEN_1_STER
type: Packaging Marked Label Accreditation Code
comment: The one-star Beter Leven (better life) mark indicates that the product comes from a company that cares that animals are kept according to the minimal requirements for sanitation and well-being for the cattle industry.
label: Beter Leven One Star Mark

BETER_LEVEN_2_STER
type: Packaging Marked Label Accreditation Code
comment: The two-star Beter Leven (better life) mark indicates that the product comes from a company that provides for a higher well-being of animals than that established by the minimal requirements for sanitation and well-being for the cattle industry, yet the conditions are inferior to those of Biological-class products.
label: Beter Leven Two Star Mark

BETER_LEVEN_3_STER
type: Packaging Marked Label Accreditation Code
comment: The three-star Beter Leven (better life) mark is awarded to products that come from companies that excel in keeping animals according to top guidelines for Biological-class products. In some cases this mark is accompanied by an EKO indication.
label: Beter Leven Three Star Mark

BIO_AUSTRIA_LABEL
type: Packaging Marked Label Accreditation Code
label: Bio Austria

BIO_LABEL_GERMAN
type: Packaging Marked Label Accreditation Code
label: German national organic certification label (Bio-Siegel)

BIO_SUISSE_BUD_SEAL
type: Packaging Marked Label Accreditation Code
label: Represents interests of Swiss organic farmers

BLUE_ANGEL
type: Packaging Marked Label Accreditation Code
comment: The Blue Angel is awarded to companies as kind of a reward for their commitment to environmental protection. They use it to professionally promote their eco-friendly products in the market. The Blue Angel is an ecological beacon showing the consumer the way to the ecologically superior product and promotes environmentally conscious consumption.
label: Blue Angel

BORD_BIA_APPROVED
type: Packaging Marked Label Accreditation Code
comment: The Bord Bia Approved logo is awarded to a company which has been audited by Bord Bia to verify that processes, from farm to fork, comply with the highest Quality Assurance Standards. These standards include animal welfare, traceability, environment, safety, feed, water, testing, inspection, hygiene and good manufacturing practice. Bord Bia Approved is awarded to a company where all the ingredients including meat content satisfy the Bord Bia requirements.
label: Bord Bia Approved Logo

BORD_BIA_APPROVED_MEAT
type: Packaging Marked Label Accreditation Code
comment: Bord Bia Approved - Meat Content Only applies to companies where only the meat content satisfies certain conditions detailed in the Bord Bia requirements document.
label: Bord Bia Approved - Meat Content Only

BRA_MILJOVAL_LABEL_SWEDISH
type: Packaging Marked Label Accreditation Code
comment: Bra Miljoval Bra is the ecolabel of SSNC. It is referred to as Good Environmental Choice in English. SSNC started ecolabelling.
label: Bra Miljoval

CROSSED_GRAIN_SYMBOL
type: Packaging Marked Label Accreditation Code
comment: Crossed grain logo is a trademark owned and administered by Coeliac. It is a worldwide symbol for safe gluten-free foods. Each country has their own Coeliac
label: Crossed grain logo

DEMETER_LABEL
type: Packaging Marked Label Accreditation Code
comment: Demeter International trademark for products of certified biodynamic production.
label: Demeter International Trademark

ECOCERT_CERTIFICATE
type: Packaging Marked Label Accreditation Code
comment: ECOCERT is a certification body for sustainable development.
label: ECOCERT Certification

ECO_LABEL_LADYBUG
type: Packaging Marked Label Accreditation Code
comment: This is a Finnish label used by the Organic union, which represents the entire Finnish organic industry, consumers and producers in a common interest group. They work as a neutral voice in various working groups and consultations, and prepare position papers and presentations. The Federation also organizes training events and professional seminars. The Organic Federation also publishes the magazine Organic.
label: Eco Label Ladybug

EC_NATIONAL_HEALTH_MARK
type: Packaging Marked Label Accreditation Code
comment: The package is physically marked with EC National Health Mark. The EC National Health Mark is the health mark for specific hygiene regulations for food of animal origin. The regulation (EC) Nr. 853/2004 of 29. April 2004 of the European Parliament on hygiene rules for food of animal origin demands that companies handling products of animal origin are authorised according to this regulation. The official body responsible for this authorisation assigns a health mark to the food producing company
label: EC National Health Mark

EESTI_OKOMARK
type: Packaging Marked Label Accreditation Code
comment: Estonian Eco Label: Ministry of Agriculture Okomark (Label of Organic Food).
label: EESTI OKOMARK (Label of Organic Food)

EESTI_PARIM_TOIDUAINE
type: Packaging Marked Label Accreditation Code
comment: Best Food Association of Estonia Food Industry http://www.toiduliit.ee/. An organisation that supports and promote Estonian food industry and economy, and contribute to a balanced and appropriate ethics to members of a favourable business environment for development.
label: Best Food Association of Estonia Food Industry

EKO
type: Packaging Marked Label Accreditation Code
comment: This symbol stands for organic production certified by Skal that meets the requirements of the EU-regulation for organic production. Skal is the inspection body for the organic production in the Netherlands.
label: Skal EKO Label

EU_ECO_LABEL
type: Packaging Marked Label Accreditation Code
comment: The item is physically marked with the European Union Eco label a European environmental initiative supported by the European Commission.
label: European Union Eco Label

EU_ORGANIC_FARMING
type: Packaging Marked Label Accreditation Code
comment: New EU organic logo the EU introduced a new organic logo to ensure consumer protection and common standards.
label: EU Organic Farming Logo

FAIR_TRADE_MARK
type: Packaging Marked Label Accreditation Code
comment: The Fair Trade Mark certifies that products meet the social, economic and environmental International Fair trade Standards. The Fair Trade Mark is usually supported by a local Fair Trade Labelling Organization and certifies products not companies. It does not cover the companies or organizations selling the product
label: The Fair Trade Mark

FALKEN
type: Packaging Marked Label Accreditation Code
label: Falken

FINNISH_HEART_SYMBOL
type: Packaging Marked Label Accreditation Code
comment: The heart symbol to inform the consumer at one glance that the product marked with this symbol is a preferred choice in its product group with regard to fat and sodium. Finnish Heart Association.
label: Finnish Heart Symbol

FOREST_STEWARDSHIP_COUNCIL_LABEL
type: Packaging Marked Label Accreditation Code
comment: The item is physically marked with the Forest Stewardship Council label.
label: Forest Stewardship Council Label

GMO_MARKED
type: Packaging Marked Label Accreditation Code
comment: The item is physically marked as of genetically modified origin.
label: GMO Marked

GOODS_FROM_FINLAND_BLUE_SWAN
type: Packaging Marked Label Accreditation Code
label: Finfood Suomen Ruokatieto Ry

GREEN_DOT
type: Packaging Marked Label Accreditation Code
label: Green Dot

GREEN_RESTAURANT_ASSOCIATION_ENDORSED
type: Packaging Marked Label Accreditation Code
comment: The item is physically marked with the Green Restaurant Association Endorsed symbol.
label: Green Restaurant Association Endorsed symbol

GREEN_SEAL_CERTIFIED
type: Packaging Marked Label Accreditation Code
comment: The item is physically marked with the Green Seal Certified symbol.
label: Green Seal Certified Symbol

GUARANTEED_IRISH
type: Packaging Marked Label Accreditation Code
comment: Ireland: The Guaranteed Irish symbol makes shopping for Irish products and services a lot easier. Shoppers know that when they buy a product or service featuring the guaranteed Irish logo they are supporting Irish companies and safeguarding Irish jobs.
label: Guaranteed Irish Symbol

KRAV_MARK
type: Packaging Marked Label Accreditation Code
label: KRAV Mark

LABEL_OF_THE_ALLERGY_AND_ASTHMA_FEDERATION
type: Packaging Marked Label Accreditation Code
comment: Allergy and Asthma Federation is a non-profit public health organisation. Our aim is to improve quality of life of the allergy and asthma patients.
label: Allergy and Asthma Federation

LEAPING_BUNNY
type: Packaging Marked Label Accreditation Code
comment: The Coalition for Consumer Information on Cosmetics (CCIC) Leaping Bunny Program administers a cruelty-free standard and the internationally recognized Leaping Bunny Logo for companies producing cosmetic, personal care, and household products. The Leaping Bunny Program provides the best assurance that no new animal testing is used in any phase of product development by the company, its laboratories, or suppliers.
label: Leaping Bunny Program

LOODUSSOBRALIK_TOODE_ESTONIA
type: Packaging Marked Label Accreditation Code
comment: Eco-friendly product The sign eco-friendly product is designed to make environmentally friendly products on store shelves more as significant. When it comes to food shall be used for agriculture, natural farming methods. No use of mineral fertilizers, insect control and plant poisons.
label: Loodussobralik Toode Estonia

LOVE_IRISH_FOOD
type: Packaging Marked Label Accreditation Code
comment: Love Irish Food - a promotional label printed on the product packaging to indicate to the consumer that the food is manufactured in Ireland using Irish ingredients.
label: Love Irish Food

MADE_IN_FINLAND_FLAG_WITH_KEY
type: Packaging Marked Label Accreditation Code
comment: Made in Finland Products that are made in Finland Avainlippu (Key Flag) Suomalaisen Tyon
label: Made in Finland

MARINE_STEWARDSHIP_COUNCIL_LABEL
type: Packaging Marked Label Accreditation Code
label: Marine Stewardship Council label

MAX_HAVELAAR
type: Packaging Marked Label Accreditation Code
comment: Fair trade symbol used in the Netherlands Target Market awarded to manufacturers which contribute to improving the living and working conditions of small farmers and agricultural workers in disadvantaged regions.
label: Max Havelaar

NATRUE_LABEL
type: Packaging Marked Label Accreditation Code
comment: The NATRUE Label guarantees that the products that carry it are made only with natural and organic ingredients, through soft manufacturing processes and environmentally friendly practices. The NATRUE Label is awarded by NATRUE, a non-profit organisation committed to promote and protect high standards of quality and environmental integrity.
label: NATRUE Label

NYCKELHALET
type: Packaging Marked Label Accreditation Code
comment: The green key hole is to be put on the healthy foods in Sweden, Denmark, and Norway within certain product groups in order to make it easier for the customers to make a healthy choice. http://www.norden.org/
label: Green Key Hole

OEKO_TEX_LABEL
type: Packaging Marked Label Accreditation Code
comment: Confidence in textiles. This has been the motto of the independent test institutes of the International Oeko-Tex Association since 1992, with their tests for harmful substances according to Oeko-Tex Standard 100 for textile products of all types which pose no risk whatsoever to health.
label: Confidence in Textiles Oeko-Tex

OFFICIAL_ECO_LABEL_SUN
type: Packaging Marked Label Accreditation Code
comment: Luomo Sun Sign Denotes controlled organic production. The official label of the Finnish inspection authorities; owned by the Ministry of Agriculture and Forestry.
label: Luomo Sun Sign

PEFC
type: Packaging Marked Label Accreditation Code
comment: Programme for Endorsement of Forest Certification (PEFCC_ is an international non-profit, non-governmental organisation dedicated to promoting Sustainable Forest Management (SFM) through independent third-party certification
label: Programme for Endorsement of Forest Certification

PROTECTED_DESIGNATION_OF_ORIGIN
type: Packaging Marked Label Accreditation Code
comment: The Protected designation of origin is the name of an area, a specific place or, in exceptional cases, the name of a country, used as a designation for an agricultural product or a foodstuff, the entire product must be traditionally and ENTIRELY manufactured (prepared, processed AND produced) within the specific region and thus acquire unique properties. Protected Geographical Status (PGS) is a legal framework defined in European Union law to protect the names of regional foods.
label: Protected Designation of Origin

PROTECTED_GEOGRAPHICAL_INDICATION
type: Packaging Marked Label Accreditation Code
comment: The Protected geographical indication is the name of an area, a specific place or, in exceptional cases, the name of a country, used as a description of an agricultural product or a foodstuff, the entire product must be traditionally and at least PARTIALLY manufactured (prepared, processed OR produced) within the specific region and thus acquire unique properties. Protected Geographical Status (PGS) is a legal framework[1] defined in European Union law to protect the names of regional foods.
label: Protected Geographical Indication

PROTECTED_HARVEST_CERTIFIED
type: Packaging Marked Label Accreditation Code
comment: The item is physically marked with the Protected Harvest Certified symbol.
label: Protected Harvest Certified Symbol

QUALITY_MARK_IRELAND
type: Packaging Marked Label Accreditation Code
comment: Control IMO Organic farming is an alternative, environmentally friendly method of food production. It forbids the use of chemicals and requires production methods that respect animal welfare and do not damage the environment. The term organic can only be used on food labels in Ireland if the food product meets strict Irish and EU organic standards and is licensed by an approved certification body.
label: Quality Mark Ireland

RAINFOREST_ALLIANCE
type: Packaging Marked Label Accreditation Code
comment: The item is physically marked with the Rainforest Alliance Certified symbol.
label: Rainforest Alliance Certified Symbol

SCHARRELVLEES
type: Packaging Marked Label Accreditation Code
comment: A symbol used in the Netherlands Target Market intended for meat based products which guarantees that the animals has been growth without the use of antibiotics.
label: Scharrelvlees

SOIL_ASSOCIATION_ORGANIC_SYMBOL
type: Packaging Marked Label Accreditation Code
comment: The Soil Association Organic Symbol is a symbol used in the UK to show that products meet a strict set of organic standards that protect health, sustainability and the environment.
label: Soil Association Organic Symbol

SUSTAINABLE_PALM_OIL_RSPO
type: Packaging Marked Label Accreditation Code
comment: In response to the urgent and pressing global call for sustainably produced palm oil, the Roundtable on Sustainable Palm Oil (RSPO) was formed in 2004 with the objective of promoting the growth and use of sustainable oil palm products through credible global standards and engagement of stakeholders.
label: Sustainably Produced Palm Oil

SVANEN
type: Packaging Marked Label Accreditation Code
comment: The Swan is the Nordic environmental label. It was established by the Nordic Council of Ministers in 1989 and Denmark joined in 1997. The Swan is used in all Nordic countries, i.e. Denmark, Norway, Sweden, Finland and Iceland.
label: Svanen

SWEDISH_SEAL_OF_QUALITY
type: Packaging Marked Label Accreditation Code
comment: The item is physically marked with the Swedish Seal of Quality label which intends to guarantee the responsibility for the environment of the product.
label: Swedish Seal of Quality Label

TRADITIONAL_SPECIALTY_GUARANTEED
type: Packaging Marked Label Accreditation Code
comment: The Traditional specialty guaranteed is a trademark for an agricultural product or a foodstuff, which has a certain feature or a set of features, setting it clearly apart from other similar products or foodstuffs belonging to the same category. The product or foodstuff must be manufactured using traditional ingredients or must be characteristic for its traditional composition, production process, or processing reflecting a traditional type of manufacturing or processing.
label: Traditional Specialty Guaranteed

TUNNUSTATUD_EESTI_MAITSE
type: Packaging Marked Label Accreditation Code
comment: Approved Estonian Taste - Quality/Tradition/Origin/Traceability for Estonian products. All raw materials must be 100% Estonian. Estonian Chamber of Agriculture and Commerce.
label: Approved Estonian Taste

TUNNUSTATUD_MAITSE
type: Packaging Marked Label Accreditation Code
comment: Approved Taste label (designed as a barn swallow) denoting Estonian origin and high quality was introduced. This label has been given to products for Food quality and safety. Estonian Chamber of Agriculture and Commerce (ECAC).
label: Tunnustatud Maitse

UNIQUELY_FINNISH
type: Packaging Marked Label Accreditation Code
comment: Uniquely Finnish http://www.maakuntienparhaat.fi/en/ The Uniquely Finnish label is a national quality label for small entrepreneurs. ProAgria Association of Rural Advisory Centres grants the label to qualified foodstuff, handicraft and rural tourism companies based on applications.
label: Uniquely Finnish

USDA
type: Packaging Marked Label Accreditation Code
label: US Department of Agriculture

UTZ_CERTIFIED
type: Packaging Marked Label Accreditation Code
comment: A certification which is intended to assure the social and environmental quality in coffee production. Coffee based products may be marked with this certification.
label: UTZ Certified

VAELG_FULDKORN_FORST
type: Packaging Marked Label Accreditation Code
comment: Grain based foods (bread, breakfast products, baking articles etc.) which have got a high content of whole grain will be puffed with a nutritional puff from the beginning of 2009: Please choose whole grain first.
label: Vaelg Fuldkorn forst

WWF_PANDA_LABEL
type: Packaging Marked Label Accreditation Code
comment: Products that support the World Wildlife Federation.
label: World Wildlife Federation Panda

BAMBOO
type: Packaging Material Type Code
label: Bamboo
comment: Any of various woody or arborescent grasses (as of the genera Bambusa, Arundinaria, and Dendrocalamus of the subfamily Bambusoideae) of tropical and temperate regions having hollow stems, thick rhizomes, and shoots. The packaging may be in the form of paper, wood or leaves.

CELLULOSE_HYDRATE
type: Packaging Material Type Code
label: Cellulose hydrate
comment: A class of materials manufactured by the conversion of natural cellulose to a soluble cellulosic derivative and subsequent regeneration, typically forming a film (e.g., cellophane).

CERAMIC
type: Packaging Material Type Code
label: Ceramic
comment: A non-specific material made from clay and hardened by firing at a high temperatures. Examples can include Terra-cotta, Earthenware, Stoneware, Porcelain, and High-Tech Ceramics.

CLOTH_OR_FABRIC
type: Packaging Material Type Code
label: Cloth or Fabric
comment: A non specific material made by weaving, felting, knitting, or crocheting natural and/or synthetic fibers.

COMPOSITE
type: Packaging Material Type Code
label: Composite
comment: A material that is made from multiple materials.

CORK_NATURAL
type: Packaging Material Type Code
label: Natural cork
comment: Cork is an impermeable buoyant material, the phellem layer of bark tissue that is harvested for commercial use primarily from Quercus suber (the cork oak).

CORRUGATED_BOARD_DOUBLE_WALL
type: Packaging Material Type Code
label: Double Wall Corrugated Board
comment: A structure formed by two layers of corrugated cardboard (flutes), with a linerboard facing between them.

CORRUGATED_BOARD_OTHER
type: Packaging Material Type Code
label: Corrugated Board Other
comment: The value needed is not listed or is not defined within this list's individual code value and definitions of corrugated boards. Please send a work request into GS1 or your solution provider requesting the code you are searching for.

CORRUGATED_BOARD_SINGLE_WALL
type: Packaging Material Type Code
label: Single Wall Corrugated Board
comment: A structure formed by three layers of paper that are glued using starch into one single, sturdy sheet; also termed double faced.

CORRUGATED_BOARD_TRIPLE_WALL
type: Packaging Material Type Code
label: Triple Wall Corrugated Board
comment: A structure formed by an inner and outer liner with three fluted sheets in between, each separated by a layer of paper.

FIBRE_BURLAP
type: Packaging Material Type Code
label: Fibre Burlap
comment: The American name for cloth woven from jute plant skins and other vegetable fibres. In other parts of the world it is known as Hessian, Hessian cloth, or gunny from the Indian gain.

FIBRE_COTTON
type: Packaging Material Type Code
label: Cotton
comment: A natural cellulosic seed-hair fiber, obtained from the seed pod of the cotton plant. First known in India about 3000 B.C.

FIBRE_FLAX
type: Packaging Material Type Code
label: Flax
comment: The plant from the stem of which bast fiber is extracted by retting to produce linen. An erroneous term for linen fiber, particularly in blends.

FIBRE_HEMP
type: Packaging Material Type Code
label: Hemp
comment: Hemp is a commonly used term for varieties of the Cannabis plant. Hemp can yield fibre which can be used in ropes, cloths, weaves, as a reinforcement of polymer composites as well as pulps for paper making.

FIBRE_JUTE
type: Packaging Material Type Code
label: Jute
comment: A bast fiber obtained from the round pod jute or the long pod jute of the family Tiliaceae. Jute ribbon is purely made from the jute plant. Grown extensively in Pakistan and India, mainly in the Bengal district of Pakistan.

FIBRE_OTHER
type: Packaging Material Type Code
label: Fibre Other
comment: A non specific material made of a unit of matter, either natural or manufactured, that forms the basic element of fabrics and other textile structures.

FOAM
type: Packaging Material Type Code
label: Solidified Foam
comment: A non specific material in a lightweight cellular form resulting from introduction of gas bubbles during manufacture, used to reduce shock and vibration or abrasion.

GLASS
type: Packaging Material Type Code
label: Glass
comment: A substance mainly consisting of sand, lime and soda, fused at high temperatures and cooled quickly so that it solidifies to a vitreous or noncrystalline condition. This term applies to transparent clear glass or as a generic term if distinction with coloured glass is not desired. Example: sodocalcite.

GLASS_BOROSILICATE
type: Packaging Material Type Code
label: Borosilicate glass
comment: Glass composed of silicon, boron, sodium and aluminum oxides (+ other alkaline oxides). It is a technical glass, not recyclable.

GLASS_COLOURED
type: Packaging Material Type Code
label: Coloured Glass
comment: Glass containing external colouring or glass that has been coloured by the addition of colouring agents/particles in its creation

GLASS_CRYSTAL
type: Packaging Material Type Code
label: Crystal glass
comment: Glass rich in lead oxide. It is a technical glass, not recyclable, typically used in decorative objects and also in certain cosmetic packaging.

LAMINATED_CARTON
type: Packaging Material Type Code
label: Laminated Carton
comment: A material made up of laminates of paperboard, foil and polyethylene which combined form a sheet suitable for asceptic processing.

METAL_ALUMINUM
type: Packaging Material Type Code
label: Aluminum
comment: A non specific material made from aluminum or aluminum alloy.

METAL_BRASS
type: Packaging Material Type Code
label: Brass
comment: Brass is an alloy of copper and zinc.

METAL_COMPOSITE
type: Packaging Material Type Code
label: Metal Composite
comment: Refers to an object that is composed of two separate metals joined together. Instead of being a mixture of two or more metals, like alloys, metal composites consist of layers of different metals.

METAL_IRON
type: Packaging Material Type Code
label: Iron
comment: A heavy metallic element (Fe) capable of being fashioned into a variety of forms.

METAL_LEAD
type: Packaging Material Type Code
label: Lead
comment: A bluish-white soft malleable ductile plastic but inelastic heavy metallic element (Pb)

METAL_OTHER
type: Packaging Material Type Code
label: Metal other
comment: A non specific material made from metal or metal alloy material.

METAL_STAINLESS_STEEL
type: Packaging Material Type Code
label: Stainless Steel
comment: An alloy of steel with chromium and sometimes another element (as nickel or molybdenum) that is practically immune to rusting and ordinary corrosion

METAL_STEEL
type: Packaging Material Type Code
label: Steel
comment: Commercial iron that contains carbon in any amount up to about 1.7 percent as an essential alloying constituent, is malleable when under suitable conditions, and is distinguished from cast iron by its malleability and lower carbon content.

METAL_TIN
type: Packaging Material Type Code
label: Tin
comment: Tin is a chemical element that is obtained chiefly from the mineral cassiterite, where it occurs as an oxide, SnO2. This silvery, malleable poor metal is not easily oxidized in air, and is used to coat other metals to prevent corrosion. It is used in many alloys, most notably bronze

METAL_ZAMAC
type: Packaging Material Type Code
label: Metal zamac
comment: Zamac is a family of alloys with a base metal of zinc and alloying elements of aluminium, magnesium, and copper.

MINERAL_CALCIUM_CARBONATE
type: Packaging Material Type Code
label: Calcium Carbonate
comment: Ground calcium carbonate and precipitated calcium carbonate products serve as functional fillers in plastic and rubber applications. Calcium carbonate is widely used as in polyvinyl chloride (PVC), polyolefin, polypropylene (PP), polyethylene (PE) and unsaturated polyester resins applications.

MINERAL_OTHER
type: Packaging Material Type Code
label: Mineral Other
comment: Any other mineral-based material not available in this list. Should be used as a temporary measure while a proper code is established

MINERAL_TALC
type: Packaging Material Type Code
label: Talc
comment: Talc is used to stiffen thermoplastics, mainly polypropylene but also polyethylene and polyamide (Nylon).

NATURAL_RUBBER
type: Packaging Material Type Code
label: Natural rubber
comment: A strong elastic material made by drying the sap from various tropical trees, especially the American rubber tree.

OTHER
type: Packaging Material Type Code
label: Other
comment: The value needed is not listed or is not defined within this list's individual code values and definitions. Please send a work request into GS1 or your solution provider requesting the code you are searching for.

PAPER_CORRUGATED
type: Packaging Material Type Code
label: Corrugated Paper
comment: Heavy paper with ridges and grooves, used in packing fragile articles.

PAPER_KRAFT
type: Packaging Material Type Code
label: Kraft paper
comment: Kraft paper is the paper grade with the highest strength. It is used for the production of e.g. paper bags, emery paper or shopping bags.

PAPER_KRAFT_WET_STRENGTH
type: Packaging Material Type Code
label: Kraft paper (wet strength)
comment: The wet-strength kraft paper has a certain tear strength when wet due to special additives. It is used for the production of e.g. paper bags, emery paper or shopping bags.

PAPER_MOLDED_PULP
type: Packaging Material Type Code
label: Molded Pulp
comment: Used for producing pulp-based or fibrous products by pressing; example products: egg packages, trays and boxes for fruits and vegetables.

PAPER_OTHER
type: Packaging Material Type Code
label: Paper Other
comment: Any other paper-based material not available in this list. Should be used as a temporary measure while a proper code is established.

PAPER_PAPER
type: Packaging Material Type Code
label: Paper
comment: A non-specific sheet material produced by the matting of fibres from wood, rags, or other fibrous materials. Generally, paper is of a lesser thickness or weight than paperboard.

PAPER_PAPERBOARD
type: Packaging Material Type Code
label: Paperboard
comment: A non specific material, generally made from cotton or wood, that describe a variety or of board materials used in the production of boxes, folding cartons, and solid fibre and corrugated shipping containers; also termed cardboard

PAPER_RAYON
type: Packaging Material Type Code
label: Rayon Paper
comment: Generic term for a manmade fiber derived from regenerated cellulose.

PLANT_LEAVES
type: Packaging Material Type Code
label: Plant Leaves
comment: Plant leaves, such as banana leaves, including wet or dry leaves. In some cases, leaves are pre-softened by steaming.

PLASTIC_BIOPLASTIC
type: Packaging Material Type Code
label: Bioplastic
comment: Plastic materials made from biomass, but may have exactly the same properties as ordinary plastic. Sometimes these plastics are biodegradable.

PLASTIC_OTHER
type: Packaging Material Type Code
label: Plastic Other
comment: A non-specific material made of any of numerous organic synthetic or processed materials that are mostly thermoplastic or thermosetting polymers of high molecular weight and that can be made into objects, films, or filaments.

PLASTIC_THERMOPLASTICS
type: Packaging Material Type Code
label: Thermoplastics
comment: A non-specific substance that becomes soft and pliable when heated, without a change in its intrinsic properties. Polystyrene and polyethylene are thermoplastics.

POLYMER_APET
type: Packaging Material Type Code
label: Polyethylene Terephthalate, amorphous (APET)
comment: Polyethylene Terephthalate, amorphous (APET) has a very high transparency, is flame retardant and suitable for direct food contact. It is used for packaging of all kinds.

POLYMER_BOPP
type: Packaging Material Type Code
label: Polypropylene, longitudinally and laterally stretched (BOPP)
comment: Biaxially oriented PP (BOPP) films are characterized by their tear, impact and puncture resistance. The film is mainly used in food packaging, e.g. as candy wrap or wrapping for chocolate bars.

POLYMER_CELLULOSE_ACETATE
type: Packaging Material Type Code
label: Cellulose Acetate
comment: Cellulose acetate is one of the most important esters of cellulose. Depending on the way it has been processed cellulose acetate can be used for a wide variety of applications, e.g. films, membranes or fibers.

POLYMER_CPET
type: Packaging Material Type Code
label: Crystallized polyethylene terephthalate (CPET)
comment: Crystallized polyethylene terephthalate (CPET) is a variation of standard PET which has been crystallized for heat resistance, rigidity, and toughness

POLYMER_EPE
type: Packaging Material Type Code
label: Expanded Polyethylene
comment: EPE is foamed polyethylene, which is a type of environmentally friendly material, that is, pearl cotton like. EPE is made of low-density polyethylene grease through a physical foaming process to produce a non-crosslinked closed cell structure. EPE can be recycled and allows a certain amount of EPE recycled material to be matched in the manufacturing process. Also known as EPE Foam.

POLYMER_EPOXY
type: Packaging Material Type Code
label: Epoxy
comment: Epoxy resins are thermoset polymers which are frequently used as coatings for metal packaging such as soft-drink cans.

POLYMER_EPS
type: Packaging Material Type Code
label: Expanded polystyrene (EPS)
comment: Expanded polystyrene is a rigid, tough, closed cell and lightweight thermoplastic foam material. It is manufactured by expanding spherical beads in a mold, using heat and pressure to fuse the beads together. While each individual bead is a closed cell environment, there are significant open spaces between each bead.

POLYMER_EVA
type: Packaging Material Type Code
label: Ethylene vinyl acetate, (EVA)
comment: Ethylene vinyl acetate, a copolymer of 60 to 90% ethylene and 40 to 10% vinyl acetate. Packaging applications include soft films, coatings, hot melt adhesives, wine cork substitutes, and closure seals for plastic and metal container caps.

POLYMER_EVOH
type: Packaging Material Type Code
label: Ethylene vinyl alcohol, (EVOH)
comment: Ethylene vinyl alcohol, a copolymer of ethylene and vinyl alcohol. A plastic resin commonly used in food applications to provide barrier to oxygen and other gases.

POLYMER_HDPE
type: Packaging Material Type Code
label: High Density Polyethylene (HDPE)
comment: High-Density PolyEthylene (HDPE) is a polyethylene thermoplastic made from petroleum. A strong, relatively opaque form of polyethylene having a dense structure with few side branches off the main carbon backbone. Can be applied to bottles, flasks and caps.

POLYMER_IONOMER
type: Packaging Material Type Code
label: Polymer ionomer
comment: Ionically is a cross-linked polyethylene (ionomer), can be used in combination with PE for its barrier properties.

POLYMER_LDPE
type: Packaging Material Type Code
label: Low-density polyethylene (LDPE)
comment: Low-density polyethylene (LDPE) is a polyethylene thermoplastic made from petroleum. A strong form of polyethylene having a less dense structure with more side branches off the main carbon backbone (on about 2% of the carbon atoms) than HDPE; therefore its tensile strength is lower, and its resilience is higherMade in translucent or opaque variations, it is quite flexible, and tough to the degree of being almost unbreakable. It is widely used for manufacturing various containers, dispensing bottles, wash bottles, tubing, plastic bags for computer components, and various moulded laboratory equipment. Its most common use is in plastic bags.

POLYMER_LLDPE
type: Packaging Material Type Code
label: Linear Low Density Polyethylene
comment: Linear low density polyethylene is a linear polyethylene with a significant number of short branches on the polymer backbone. It is commonly made by copolymerization of ethylene with longer-chain olefins. It is different from LDPE due to the absence of long chain branches which gives it higher tensile strength, impact and puncture resistance than LDPE. Common uses of LLDPE are plastic bags, wraps, stretch wraps, pouches, covers and lids.

POLYMER_MDPE
type: Packaging Material Type Code
label: Medium-density Polyethylene
comment: Medium-density polyethylene is a type of polyethylene defined by a density range of 0.926-0.940 g/cm3. MDPE is typically used in shrink films, sacks, packaging film and carrier bags.

POLYMER_MIX
type: Packaging Material Type Code
label: Polymer mix
comment: A polymer blend or mixture of least two polymers that are blended to create a new material with different physical properties. These tend to be a proprietary mix of polymers and cannot be separated. The individual materials may not be known by the seller.

POLYMER_NYLON
type: Packaging Material Type Code
label: Nylon
comment: Packaging applications include oven-baking bags (nylon 6 and nylon 66) and barrier layers (MXD6 and nylon 6) for PET and HDPE bottles. Very occasionally, bottles can be made of nylon.

POLYMER_OPP
type: Packaging Material Type Code
label: Oriented polypropylene (OPP)
comment: Oriented polypropylene (OPP) is made of a soft polypropylene material which is stretched in a transverse or longitudinal direction (monoaxial) and becomes therefore brittle. Also known as: biaxially oriented polypropylene (BOPP), CAS Registry Number: 9003-07-0

POLYMER_OTHER
type: Packaging Material Type Code
label: Polymers Other
comment: A non-specific chemical compound or mixture of compounds formed by polymerization and consisting essentially of repeating structural units

POLYMER_PA
type: Packaging Material Type Code
label: Polyamide (PA)
comment: A polymer with repeating units linked by amide bonds. Polyamides (PA) occur both naturally and artificially, examples of naturally occurring polyamides are proteins, such as wool and silk. Artificially made polyamides can be nylons, aramids, and sodium poly(aspartate).

POLYMER_PAN
type: Packaging Material Type Code
label: Polyacrylonitril (PAN)
comment: Polyacrylonitril is a organic polymer which is frequently used in fibres for textiles. As fibres the material is frequently referred to as Acrylic.

POLYMER_PC
type: Packaging Material Type Code
label: Polycarbonate (PC)
comment: Polycarbonate, a transparent thermoplastic which is used in a wide variety of applications including CDs and DVDs, eyeglasses, cell phone covers, laptops as well as packaging applications such as bottles.

POLYMER_PCL
type: Packaging Material Type Code
label: Polycaprolactone (PCL)
comment: Polycaprolactone is a biodegradable polyester which is also used in in the manufacturing of polyurethanes. It is also used in blends with thermoplastic starch to improve properties and can also be used as a plasticizer to PVC.

POLYMER_PE
type: Packaging Material Type Code
label: Polyethylene (PE)
comment: A thermoplastic composed of the polymers of ethylene.

POLYMER_PEN
type: Packaging Material Type Code
label: Polyethylene Naphthalate (PEN)
comment: Polyethylene naphthalate is a polymer with good barrier properties (unlike Polyethylene terephthalate). It is well-suited for production of the amber-colored bottles meant for packing beverages like beer.

POLYMER_PET
type: Packaging Material Type Code
label: Polyethylene Terephthalate (PET)
comment: Polyethylene terephthalate is a thermoplastic polymer resin of the polyester family and is used in synthetic fibers. Can be applied to bottles, flasks and caps.

POLYMER_PETG
type: Packaging Material Type Code
label: Polyethylene Terephthalate Glycol (PETG)
comment: Polyethylene Terephthalate Glycol (PETG) is a PET modified with glycol, which is characterized by its aqueous properties (viscosity). Applications are found in injection molding.

POLYMER_PHA
type: Packaging Material Type Code
label: Polyhydroxyalkanoates (PHA)
comment: Polyhydroxyalkanoates are linear polyesters produced in nature by bacterial fermentation of sugar or lipids.

POLYMER_PLA
type: Packaging Material Type Code
label: Polylactic Acid or Polylactide (PLA)
comment: Polylactic acid or Polylactide is a biodegradable, thermoplastic, aliphatic polyester derived from lactic acid.

POLYMER_PMMA
type: Packaging Material Type Code
label: Polymethyl Methacrylate (PMMA)
comment: Polymethyl Methacrylate (PMMA) is often used as a lightweight and shatterproof alternative to glass, due to its transparency, brilliance and scratch resistance, PMMA is therefore often referred to as acrylic glass.

POLYMER_POM
type: Packaging Material Type Code
label: Polyoxymethylene (POM)
comment: Polyoxymethylene (POM) is a thermoplastic with good mechanical properties and high dimensional stability. Fields of application are the automotive industry and electrical engineering, in packaging it is used for e.g. spray cans, gas lighter tanks, gas ampoules. Also known as acetal, polyacetal, and polyformaldehyde.

POLYMER_PP
type: Packaging Material Type Code
label: Polypropylene (PP)
comment: A non-specific material made of various thermoplastic plastics or fibers that are polymers of propylene.

POLYMER_PS
type: Packaging Material Type Code
label: Polystyrene (PS)
comment: A polymer prepared by the polymerization of styrene as the sole monomer

POLYMER_PU
type: Packaging Material Type Code
label: Polyurethanes (PU)
comment: Polyurethanes are primarily thermoset resins which are used in the manufacture of flexible and rigid foams, microcellular foam seals and gaskets, as well as high performance adhesives, surface coatings and sealants. Polyurethane can also be used to make synthetic fibers.

POLYMER_PVA
type: Packaging Material Type Code
label: Polyvinyl Alcohol (PVA)
comment: Polyvinyl alcohol (PVA or PVOH) is a biodegradable and highly water soluble polymer with high gas and grease barrier. Common uses for PVA are paper adhesives, paper coatings, as a self-standing water soluble films as well as blends to improve processability of thermoplastic starch.

POLYMER_PVC
type: Packaging Material Type Code
label: Polyvinyl Chloride (PVC)
comment: A polymer of vinyl chloride used especially for electrical insulation, films, and pipes

POLYMER_PVDC
type: Packaging Material Type Code
label: Polyvinylidene Chloride (PVDC)
comment: Polyvinylidene chloride is primarily used as a barrier coating to provide barrier against fat, vapour and gases.

POLYMER_SAN
type: Packaging Material Type Code
label: Styrene acrylonitrile (SAN)
comment: Styrene acrylonitrile (SAN) is a copolymer transparent and rigid plastic. Examples of applications are kitchenware and cosmetic packaging.

POLYMER_SILICONE
type: Packaging Material Type Code
label: Polymer silicone
comment: Polymer is generally composed of organic chains linked together by the silicon-oxygen bond. Used in particular for valves. Also know as polysiloxane.

POLYMER_TPS
type: Packaging Material Type Code
label: Thermoplastic Starch (TPS)
comment: Thermoplastic starch is obtained through destructurization of natural starch through exposure to shear and heat. TPS is most frequently used in blends with biodegradable synthetic polymers such as PCL and PVA.

POLYMER_XPS
type: Packaging Material Type Code
label: Extruded polystyrene (XPS)
comment: Extruded polystyrene is a rigid, tough, closed cell and lightweight thermoplastic foam material. It is manufactured using a process of extrusion that produces a homogeneous 'closed cell' matrix with each cell fully enclosed by polystyrene walls.

RUBBER
type: Packaging Material Type Code
label: Rubber
comment: A strong elastic synthetic substance made either by improving the qualities of natural rubber or by an industrial process using petroleum and coal products

VINYL
type: Packaging Material Type Code
label: Vinyl
comment: A non-specific polymer of a vinyl compound or a product (as a resin or a textile fiber) made from such a polymer

WOOD_HARDBOARD
type: Packaging Material Type Code
label: Hardboard
comment: Hardboard (not to be confused with hardwood), also called High-Density Fiberboard (HDF), is a type of fiberboard, which is similar to particle board and medium-density fiberboard, but is denser, much stronger and harder because it is made out of exploded wood fibers which have been highly compressed. Consequently, the density of hardboard is 31 lbs or more per cubic foot (500 kg/m_)[2] and is usually about 50-65 lbs per cubic foot (800-1040 kg/m_). It differs from particle board in that the bonding of the wood fibers requires no additional materials, although resin is often added. Unlike particle board, it will not split or crack.

WOOD_HARDWOOD
type: Packaging Material Type Code
label: Hardwood
comment: A general term referring to any variety of broad-leaved, deciduous trees, and the wood from those trees. The term has nothing to do with the actual hardness of the wood; some hardwoods are softer than certain softwood (evergreen) species.

WOOD_MEDIUM_DENSITY_FIBREBOARD
type: Packaging Material Type Code
label: Medium density fibreboard
comment: Medium-Density Fibreboard (MDF) is an engineered wood product made by breaking down hardwood or softwood residuals into wood fibres, combining them with wax and a resin binder, and forming panels by applying high temperature and pressure. MDF is generally denser than plywood. It is made up of separated fibres, but can be used as a building material similar in application to plywood. It is stronger and much more dense than particle board.

WOOD_ORIENTED_STRANDBOARD
type: Packaging Material Type Code
label: Oriented strand board (OSB)
comment: Oriented Strand Board (OSB), also known as sterling board, sterling OSB, aspenite, and smartply, is an engineered wood particle board formed by adding adhesives and then compressing layers of wood strands (flakes) in specific orientations. OSB may have a rough and variegated surface with the individual strips of around 2.5 - 15 cm (1 - 6 inch), lying unevenly across each other and comes in a variety of types.

WOOD_OTHER
type: Packaging Material Type Code
label: Wood other
comment: A non specific material made from the hard fibrous lignified substance under the bark of trees.

WOOD_PARTICLE_BOARD
type: Packaging Material Type Code
label: Particle board
comment: Particle Board, also known as particleboard, chipboard, and Low-Density Fiberboard (LDF), is an engineered wood product manufactured from wood chips, sawmill shavings, or sawdust, and a synthetic resin or other suitable binder, which is pressed and extruded. Particle board is a composite material.

WOOD_PLYWOOD
type: Packaging Material Type Code
label: Plywood
comment: Plywood, a manufactured wood panel similar to LDF, MDF, and HDF, is made from layering thin sheets of wood. Plywood layers (called veneers or plies) are glued together, with adjacent plies having their wood grain rotated relative to adjacent layers up to 90 degrees. All plywoods bind resin and wood fibre sheets (cellulose cells are long, strong and thin) to form a composite material.

WOOD_SOFTWOOD
type: Packaging Material Type Code
label: Softwood
comment: General term used to describe lumber produced from needle and/or cone bearing trees (Conifers).

COMPOSTABLE
type: Packaging Recycling Process Type Code
comment: Packaging that can biodegrade generating a relatively homogeneous and stable humus-like substance.
label: Compostable

ENERGY_RECOVERABLE
type: Packaging Recycling Process Type Code
comment: Packaging which allows for a net calorific gain in energy recovery operations.
label: Energy Recoverable

RECYCLABLE
type: Packaging Recycling Process Type Code
comment: Packaging material and format which can be diverted from the waste stream through available processes and programmes and can be collected, processed and returned to use in the form of raw materials or products.
label: Recyclable

REUSABLE
type: Packaging Recycling Process Type Code
comment: Packaging that has been conceived and designed to accomplished within its life cycle a certain number of trips, rotations or uses for the same purpose for which it was conceived.
label: Reusable

ALKO
type: Packaging Recycling Scheme Code
comment: Alko inc. is an independent, entirely State-owned company. Alko is administered and supervised by the Ministry of Social Affairs and Health. They have own recycling system for alcohol products bottles called Alko. This is a recycling system used in Finland
label: Alko Inc

A_PULLO
type: Packaging Recycling Scheme Code
comment: PALPA stands for Suomen Palautuspakkaus Oy. PALPA administers the recycling of beverage containers and promotes recycling in Finland. A-pullo is one of the recycling systems. PALPA is the administrator. This is a recycling system used in Finland.
label: A Pullo

EKO_PULLO
type: Packaging Recycling Scheme Code
comment: PALPA Standas for Suomen Palautuspakkaus Oy. PALPA administers the recycling of beverage containers and promotes recycling in Finland. EKO-pullo is one of the recycling systems PALPA is administer. This is a recycling system used in Finland.
label: EKO Pullo

PALPA
type: Packaging Recycling Scheme Code
comment: PALPA stands for Suomen Palautuspakkaus Oy. PALPA administers the recycling of beverage containers and promotes recycling in Finland. PALPA is on of the recycling systems PALPA is administer. This is a recycling system used in Finland.

BAR
type: Packaging Shape Code
comment: A relatively long, evenly shaped piece of some solid substance
label: Bar

COIL
type: Packaging Shape Code
comment: A spiral structure made by winding a material into a series of loops. A coil may or may not have a spindle around which the loops are formed.
label: Coil

CONE
type: Packaging Shape Code
comment: A cone is a three-dimensional geometric shape that tapers smoothly from a flat, round base to a point.
label: Cone

CYLINDRICAL
type: Packaging Shape Code
comment: A long shape that has a circular base and an equally-sized circular top.
label: Cylindrical

POLYGON
type: Packaging Shape Code
comment: A plane figure that is bounded by a closed path or circuit composed of a finite sequence of equally-sized straight line segments. A polygon may have a varying number of segments or faces resulting in different configurations, for example a 5-faced polygon: pentagon, 6-faced: hexagon, 8-faced: octagon, 12-faced: dodecahedron, etc.
label: Polygon

RECTANGULAR
type: Packaging Shape Code
comment: A closed planar quadrilateral with four right angles.
label: Rectangular

SPHERICAL
type: Packaging Shape Code
comment: A perfectly round geometrical object in three-dimensional space, such as the shape of a round ball. Like a circle in two dimensions, a perfect sphere is completely symmetrical around its centre, with all points on the surface lying the same distance from the centre point.
label: Spherical

TABLET
type: Packaging Shape Code
comment: The result of different materials being compressed into a solid block usually of small dimensions.
label: Tablet

UNSPECIFIED
type: Packaging Shape Code
comment: Shape is not currently specified in the list. To be used as a temporary means until a specific missing value is added to the list.
label: Unspecified

BANKERS_DRAFT
type: Payment Method Code
comment: Issue of a banker's draft in payment of the funds.
label: Bankers Draft

BANK_CHEQUE
type: Payment Method Code
comment: Payment by a pre-printed form, which has been completed by a financial institution, on which instructions are given to an account holder (a bank or building society) to pay a stated sum to a named recipient.
label: Bank Cheque

BANK_GIRO
type: Payment Method Code
comment: The payment was originally made by bankgiro.
label: Bank Giro

BOOKENTRY_CREDIT
type: Payment Method Code
comment: House Credit.
label: Book Entry Credit

BOOKENTRY_DEBIT
type: Payment Method Code
comment: House Debit.
label: Book Entry Debit

BOP
type: Payment Method Code
coment: Payment by balance of payments

CASH
type: Payment Method Code
comment: Payment by currency (including bills and coins) in circulation, including checking account deposits.
label: Cash

CERTIFIED_CHEQUE
type: Payment Method Code
comment: Payment by a pre-printed form stamped with the paying bank's certification on which instructions are given to an account holder (a bank or building society) to pay a stated sum to a named recipient .
label: Certified Cheque

CHEQUE
type: Payment Method Code
comment: Payment by a pre-printed form on which instructions are given to an account holder (a bank or building society) to pay a stated sum to a named recipient.
label: Cheque

CREDIT_CARD
type: Payment Method Code
comment: Payment by means of a card issued by a bank or other financial institution.
label: Credit Card

CREDIT_CARD_AMEX
type: Payment Method Code
comment: Payment by American Express credit card
label: American Express Credit Card

CREDIT_CARD_DINERS_CLUB
type: Payment Method Code
comment: Payment by Diners Club credit card
label: Diners Club Credit Card

CREDIT_CARD_DISCOVER
type: Payment Method Code
comment: Payment by Discover credit card
label: Discover Credit Card

CREDIT_CARD_MASTERCARD
type: Payment Method Code
comment: Payment by Mastercard credit card
label: Mastercard Credit Card

CREDIT_CARD_VISA
type: Payment Method Code
comment: Payment by Visa credit card
label: Visa Credit Card

DEBIT_CARD
type: Payment Method Code
comment: The amount is to be, or has been, directly debited to the customer's bank account through a bank card.
label: Debit Card

DEBIT_CARD_MAESTRO
type: Payment Method Code
comment: Payment by Maestro debit card
label: Maestro Debit Card

DEBIT_CARD_MASTERCARD
type: Payment Method Code
comment: Payment by Mastercard debit card
label: Mastercard Debit Card

DEBIT_CARD_VISA
type: Payment Method Code
comment: Payment by Visa debit card
label: Visa Debit Card

DEBIT_CARD_VISA_ELECTRON
type: Payment Method Code
comment: Payment by Visa Electron debit card
label: Visa Electron Debit Card

ELECTRONIC_CREDIT_ACH
type: Payment Method Code
comment: A credit transaction made through the automated clearing house system
label: Electronic Credit ACH

ELECTRONIC_DEBIT_ACH
type: Payment Method Code
comment: A debit transaction made through the automated clearing house system.
label: Electronic Debit ACH

FED_WIRE_NON_REPETITIVE
type: Payment Method Code
comment: Fedwire is a real time gross settlement funds transfer system operated by the Federal Reserve Banks that enables financial institutions to electronically transfer funds between its participants.
label: Fedwire Non-repetitive

FED_WIRE_REPETITIVE
type: Payment Method Code
comment: Repetitive Fedwire is a real time gross settlement funds transfer system operated by the Federal Reserve Banks that enables financial institutions to electronically transfer funds between its participants. Repetitive wire transfers are sent by the same party to the same recipient through the same financial institution with the same wiring instructions
label: Fedwire Repetitive

INTERNATIONAL_WIRE
type: Payment Method Code
comment: Payment by international wire transfer
label: International Wire

LETTER_OF_CREDIT
type: Payment Method Code
comment: The financial operation is a letter of credit.
label: Letter of Credit

ONLINE_PAYMENT
type: Payment Method Code
comment: Payment by online payment mechanisms
label: Online Payment

ONLINE_PAYMENT_APPLE_PAY
type: Payment Method Code
comment: Online payment via Apple Pay
label: Apple Pay

ONLINE_PAYMENT_GOOGLE_WALLET
type: Payment Method Code
comment: Online payment via Google Wallet
label: Google Wallet

ONLINE_PAYMENT_PAYPAL
type: Payment Method Code
comment: Online payment via PayPal
label: PayPal

POSTGIRO
type: Payment Method Code
comment: The financial operation has been done by postgiro.
label: Postgiro

WIRE_TRANSFER_CREDIT
type: Payment Method Code
comment: Payment by wire transfer credit
label: Wire Transfer Credit

WIRE_TRANSFER_DEBIT
type: Payment Method Code
comment: Payment by wire transfer debit
label: Wire Transfer Debit

Power
type: Measurement type
comment: The rate of doing work or rate of production, transfer or consumption of energy; the amount of energy transferred or converted per unit time. SI Units: watt

AS_DRAINED
type: Preparation Type Code
comment: The state of the product after it has been separated from any liquid within the package. For example, a can of apricots in syrup would have a different nutritional composition if the apricots are consumed with the syrup rather than if the syrup is drained before consuming the apricots (because of the high sugar and energy content of the syrup).
label: As Drained

BAKE
type: Preparation Type Code
comment: Cooking food in an oven by dry heat applied evenly throughout the oven
label: Bake

BARBECUE
type: Preparation Type Code
comment: Method of cooking meat with the heat and hot gasses of a fire
label: Barbecue

BLANCH
type: Preparation Type Code
comment: Food preparation wherein the food substance is rapidly plunged into boiling water and then removed after a brief, timed interval and then plunged into iced water or placed under cold running water
label: Blanch

BLIND_BAKE
type: Preparation Type Code
comment: Baking a pie crust or other pastry without the filling
label: Blind Bake

BOIL
type: Preparation Type Code
comment: Cooking food in boiling water, or other water-based liquid such as stock or milk
label: Boil

BRAISE
type: Preparation Type Code
comment: Cooking with moist heat, typically in a covered pot with a small amount of liquid
label: Braise

BROIL
type: Preparation Type Code
comment: Cooking food with high heat with the heat applied directly to the food, most commonly from above. Heat transfer to the food is primarily via radiant heat
label: Broil

DEEP_FRY
type: Preparation Type Code
comment: Cooking method whereby food is submerged in hot oil or fat.
label: Deep Fry

DOUBLE_STEAM
type: Preparation Type Code
comment: Cooking technique to prepare delicate food such as bird nests, shark fins etc. The food is covered with water and put in a covered ceramic jar
label: Double Steam

FREEZE
type: Preparation Type Code
comment: Convert the product from room temperature to a frozen state.Simple
label: Freeze

FRY
type: Preparation Type Code
comment: Cooking of food in fat.
label: Fry

GRIDDLE_FRY
type: Preparation Type Code
comment: Form of cooking where the food is fried with its own fat.
label: Griddle Fry

GRILL
type: Preparation Type Code
comment: Form of cooking that involves direct heat. The definition varies widely by region and culture
label: Grill

HEAT_AND_SERVE
type: Preparation Type Code
comment: Prepare the item by simply heating or warming to a desired temperature or visual state prior to serving
label: Heat and Serve

MICROWAVE
type: Preparation Type Code
comment: Cooking food by employing microwave radiation
label: Microwave

PAN_FRY
type: Preparation Type Code
comment: Form of frying characterised by the use of less cooking oil than deep frying
label: Pan Fry

POACH
type: Preparation Type Code
comment: Cooking food by gently simmering food in liquid, generally water, stock or wine
label: Poach

PREPARED
type: Preparation Type Code
comment: The state of the product after preparation (e.g. after adding milk or water).
label: Prepared

PRESSURE_COOK
type: Preparation Type Code
comment: Method of cooking in a sealed vessel that does not permit air or liquids to escape below a preset pressure
label: Pressure Cook

PRESSURE_FRY
type: Preparation Type Code
comment: Meat and cooking oil are brought to high temperatures while pressure is held high enough that the water within is prevented from boiling off
label: Pressure Fry

READY_TO_DRINK
type: Preparation Type Code
comment: No Preparation. The product is ready for use after being taken out of the packaging (if packaging exists) without the need of any further action prior to consumption or use
label: Ready To Drink

READY_TO_EAT
type: Preparation Type Code
comment: Besides unpacking no additional preparation required.
label: Ready To Eat

RECONSTITUTE
type: Preparation Type Code
comment: Restore a dry or concentrated food to its original strength or consistency by adding water.
label: Reconstitute

REFRIGERATE
type: Preparation Type Code
comment: Convert the product from room temperature to a chilled state.
label: Refrigerate

ROAST
type: Preparation Type Code
comment: Cooking method that uses dry heat, whether an open flame, oven, or other heat source.
label: Roast.

ROTISSERIE
type: Preparation Type Code
comment: Style of roasting where meat is skewered on a spit and revolves over a flame
label: Rotisserie

SAUTE
type: Preparation Type Code
comment: Cooking food using a small amount of fat in a shallow pan over relatively high heat
label: Saute

SEAR
type: Preparation Type Code
comment: Technique used in grilling, roasting, braising, sauteing, etc. That cooks the surface of the food (usually meat, poultry or fish) at high temperature so that a caramelised crust forms
label: Sear

SIMMER
type: Preparation Type Code
comment: Cook food by heating it in water kept just below the boiling point (same as coddling)
label: Simmer

SMOKE
type: Preparation Type Code
comment: Process of curing, cooking, or seasoning food by exposing it for long periods of time to the smoke from a wood fire
label: Smoke

STEAM
type: Preparation Type Code
comment: Cooking by first boiling the water so it will evaporate into steam, then the steam will carry heat to the food, thus achieving heating the food
label: Steam

STEW
type: Preparation Type Code
comment: Preparing meat cut into smaller pieces or cubes by simmering it in liquid, usually together with vegetables
label: Stew

STIR_FRY
type: Preparation Type Code
comment: Chinese cooking technique used because of its fast cooking speed
label: Stir Fry

THAW
type: Preparation Type Code
comment: Convert the product from a frozen state to a chilled or room temperature state.
label: Thaw

UNPREPARED
type: Preparation Type Code
comment: The initial state of the product.
label: Unprepared

UNSPECIFIED
type: Preparation Type Code
comment: Unknown, not applicable
label: Unknown

ACIDIFICATION
type: Preservation Technique Code
comment: Dropping pH of food
label: Acidification

ALCOHOL_CURING
type: Preservation Technique Code
comment: Treatment of food by adding alcohol in order to preserve the product
label: Alcohol Curing

ATTESTED_MILK
type: Preservation Technique Code
comment: Raw Milk (without heat treatment)
label: Attested Milk

BOILING
type: Preservation Technique Code
comment: Cooking
label: Cooking

BRINING
type: Preservation Technique Code
comment: Water saturating or strongly impregnating with salt
label: Brining

CANNING
type: Preservation Technique Code
comment: Preserved in a sealed airtight container, usually made of tin-coated iron
label: Canning

COLD_SMOKE_CURING
type: Preservation Technique Code
comment: To smoke the food at between 70 degrees to 90 degrees F.
label: Cold Smoke Curing

CONSERVE
type: Preservation Technique Code
comment: Keep from harm or damage
label: Conserve

DEHYDRATION
type: Preservation Technique Code
comment: To remove water from food
label: Dehydration

DRYING
type: Preservation Technique Code
comment: Making with moisture having evaporated, drained away
label: Drying

FERMENTATION
type: Preservation Technique Code
comment: Any of a group of chemical reactions induced by living or nonliving ferments that split complex organic compounds into relatively simple substance
label: Fermentation

FREEZE_DRYING
type: Preservation Technique Code
comment: Preserving food by freezing and then drying in a vacuum
label: Freeze Drying

FREEZING
type: Preservation Technique Code
comment: Turning into ice or another solid by cold
label: Freezing

HIGH_TEMPERATURE_TREATED_MILK
type: Preservation Technique Code
comment: Legally also pasteurisation, MHD for longer (about 2 to 3 weeks), ESL-milk
label: High Temperature Treated Milk

HOT_SMOKE_CURING
type: Preservation Technique Code
comment: Hot-smoking partially or totally cooks the food by treating it at temperatures ranging from 100 degrees to 190 degrees F.
label: Hot Smoke Curing

IONISATION
type: Preservation Technique Code
comment: To convert into an ion or ions
label: Ionisation

IRRADIATION
type: Preservation Technique Code
comment: Food irradiation is the process of exposing food to ionising radiation in order to disinfest, sterilise, or preserve food.
label: Irradiation

PASTEURISATION
type: Preservation Technique Code
comment: Partially sterilisation by heating
label: Pasteurisation

QUICK_FREEZING
type: Preservation Technique Code
comment: Freezing (food) rapidly so as to preserve its qualities
label: Quick Freezing

SALT_CURING
type: Preservation Technique Code
comment: Preserving by using a salt brine
label: Salt Curing

SOUS_VIDE
type: Preservation Technique Code
comment: Low temperature long time cooking under vacuum
label: Sous Vide

STERILISATION
type: Preservation Technique Code
comment: A process that effectively kills or eliminates transmissibleagents (such as fungi, bacteria, viruses, spore forms, etc.).
label: Sterilisation

SUGAR_CURING
type: Preservation Technique Code
comment: Treatment of food by adding sugar in order to preserve the product
label: Sugar Curing

ULTRA_HIGH_TEMPERATURE
type: Preservation Technique Code
comment: Ultra heat treated (especially for milk)
label: Ultra High Temperature

UNDER_MODIFIED_ATMOSPHERE
type: Preservation Technique Code
comment: Packed with a gas with protective proprieties
label: Under Modified Atmosphere

VACUUM_PACKED
type: Preservation Technique Code
comment: Sealed after the partial removal of air
label: Vacuum Packed

Pressure
type: Measurement type
comment: The perpendicular force per unit area acting on a material and tending to change its dimensions. SI Units: pascal, newton per square metre

AFTER_COOKING
type: Product Yield Type Code
comment: Weight or volume of food product after it has been prepared.
label: After Cooking

AFTER_DILUTION
type: Product Yield Type Code
comment: Volume of food product after a fluid has been added.
label: After Dilution

DRAINED_WEIGHT
type: Product Yield Type Code
comment: Weight of food product after the fluid in which the food product was preserved has been removed.
label: Drained Weight

UNSPECIFIED
type: Product Yield Type Code
comment: Product yield type is unknown or irrelevant
label: Unspecified

RadiantFlux
type: Measurement type
label: Radiant flux
comment: The total power emitted, received or passing in the form of electromagnetic radiation; a measure of electromagnetic energy per unit time. SI Units: watt

RadiantIntensity
type: Measurement type
label: Radiant intensity
comment: The radiant flux per unit solid angle emitted by a point source. SI Units: watt / steradian

Radioactivity
type: Measurement type
comment: The rate of spontaneous disintegration or decay of certain natural heavy elements, accompanied by alpha-rays, beta-rays or gamma-rays. SI Units: becquerel
alternative label: Activity

360_DEGREE_IMAGE
type: Referenced File Type Code
label: 360 Degree Image
comment: Allows x-axis interactive rotation of product via website.

AMBIENCE_MOOD_IMAGE
type: Referenced File Type Code
label: Ambience/mood image
comment: Trade Item image representing the image the manufacturer is supplying to the consumer to invoke a connection to the item by setting a 'mood' or feeling for the item and its use.

APPLICATION_IMAGE
type: Referenced File Type Code
label: Application image
comment: Trade Item image representing the image the manufacturer is supplying to the consumer to depict how the product itself is used.

ASSEMBLY_INSTRUCTIONS
type: Referenced File Type Code
label: Assembly Instructions
comment: Link to a file the explains how to assemble (put together) the trade item.

AUDIO
type: Referenced File Type Code
label: Audio
comment: Link to a file containing an audio clip which is relevant to the product. Examples are commercials, or instructional/ how to use audio files.

AWARD_CERTIFICATE
type: Referenced File Type Code
label: Award certificate
comment: The award certificate is a written document created by the Award Committee that describes the terms and conditions of the Award. Example: http://www.cronierwines.com/awards-in-2016/

BARCODE
type: Referenced File Type Code
label: Barcode
comment: Link to a file containing a visual representation of the barcode which is on the product or its packaging.

CERTIFICATION
type: Referenced File Type Code
label: Certification
comment: Document which contains a special certification by a third party (e.g. International Food Standard [IFS], QS-Approval Mark for meat product, sausage, fruit, vegetables and potatoes or bio audits).

CHEMICAL_ASSESSMENT_SUMMARY
type: Referenced File Type Code
label: Chemical Assessment Summary
comment: Link to a file containing the chemical ingredient information sent to the supplier from a third party as a result of the assessment.

CHEMICAL_SAFETY_REPORT
type: Referenced File Type Code
label: Chemical Safety Report
comment: Link to the file containing a report detailing the risks arising from the manufacture and/or use of a substance and to ensure that they are adequately controlled.

CHILD_NUTRITION_LABEL
type: Referenced File Type Code
label: Child Nutrition Label
comment: Link to a file containing the Child Nutrition Label as formatted according to regulations and rules of an appropriate regulatory body for the target market.

CLEANING_DISINFECTION_STERILISATION_INSTRUCTIONS
type: Referenced File Type Code
label: Cleaning, disinfection and sterilisation instructions
comment: The cleaning, disinfection and/or sterilisation instructions that apply to the product. These may be in accordance with EN-ISO 17664.

CLINICIAN_MEDICINE_INFORMATION
type: Referenced File Type Code
label: Clinician medicine information
comment: A clinician focused product information document that is written by the pharmaceutical company responsible for the medicine. This document is intended to assist doctors, pharmacists and other health professionals in prescribing and dispensing medicines. In addition, this information can be used by health professionals in their consultations with patients, so that the patient can be better informed about their medicines.

CONSUMER_HANDLING_AND_STORAGE
type: Referenced File Type Code
label: Consumer Handling and Storage
comment: Link to a website, file, or image containing the manufacturer's recommendations for how the consumer or end user should store and handle the product.

CONTENT_TEXTURE_IMAGE
type: Referenced File Type Code
label: Content/texture image
comment: Trade Item image representing the image the manufacturer is supplying to the consumer to depict the content or texture of an item. The image should be designed in such a way that the texture can be experienced by the consumer similar to stationary retail, e.g. creme, lipstick.

CROSSSECTION_VIEW
type: Referenced File Type Code
label: Crosssection View
comment: A picture of a trade item with a cut away vertical plane removed (e.g. Cross-section of a Tire revealing steel belts and tire tread detail).

DECLARATION_OF_CONFORMITY
type: Referenced File Type Code
label: Declaration of Conformity
comment: A Declaration of Conformity is a document in which the manufacturer states that the product satisfies the essential requirements of the applicable legislation(s), e.g. for toys, medical devices or electrical equipment. By drawing up and signing the EU Declaration of Conformity, the manufacturer assumes responsibility for the compliance of the product. For more information please see https://eur-lex.europa.eu/legal-content/EN/TXT/PDF/?uri=CELEX:32019R1020&from=DE

DIET_CERTIFICATE
type: Referenced File Type Code
label: Diet Certificate
comment: Link to a website or file containing a diet certificate granted to the product

DISPOSAL_INSTRUCTIONS
type: Referenced File Type Code
label: Instructions for disposal
comment: Link to a website, file or instruction movie how to dispose a product properly or how to clean up a broken product in case the product contains materials like mercury.

DOCUMENT
type: Referenced File Type Code
label: Document
comment: Link to a document or text file containing product information. Examples of this type could be an instruction manual, assembly guide, or warranty document.

DOP_SHEET
type: Referenced File Type Code
label: Dop Sheet
comment: Link to a file containing the product's Declaration of Performance Sheet (DOP). This file can be either an image or a document.

DRUG_FACT_LABEL
type: Referenced File Type Code
label: Drug Fact Label
comment: The file link is to a drug fact panel of the trade item. A drug fact label usually contains such items as active ingredients, uses, warnings, purpose, directions, etc.

ECOLOGICAL_FACT_SHEET
type: Referenced File Type Code
label: Ecological fact sheet
comment: Link to a file containing the details of a product with its environmental impact and performance. E.g. Beelong.ch Eco-Score Fact Sheet.

ENERGY_LABEL
type: Referenced File Type Code
label: Energy Label
comment: Link to the energy label for a trade item. On 19 May 2010, the EU adopted the Directive 2010/30/EU on energy labels. Energy labels help consumers choosing products which save energy and thus money. They also provide incentives for the industry to develop and invest in energy efficient product design. They are found on a selection of white goods and other products and are designed to help customers see how energy efficient a model is before they buy.

FOOD_CONTACT_CONFORMITY_CERTIFICATE
type: Referenced File Type Code
label: Food contact conformity certificate
comment: The certificate of conformity for suitability for food contact is a document issued by the manufacturer or the person placing the product on the European market. It certifies that the product sold complies with the EC Regulation 1935/2004. Thus, it is proven to be safe to get in contact with food.

GROUP_CHARACTERISTIC_SHEET
type: Referenced File Type Code
label: Group Characteristic Sheet

HAZARDOUS_SUBSTANCES_DATA
type: Referenced File Type Code
label: Hazardous Substances Data
comment: Link to a file where to locate the 'out of network data' additional data concerning the control of substances can be found.

IFU
type: Referenced File Type Code
label: IFU/eIFU (Instructions for use)
comment: Link to a file containing the (electronic) Instructions For Use (IFU or eIFU).

IFU_INCLUDING_CLEANING_DISINFECTION_STERILISATION_INSTRUCTIONS
type: Referenced File Type Code
label: Instructions for use including cleaning disinfection sterilisation instructions
comment: Indicates that the instructions for cleaning/disinfecting/sterilisation are included in the IFU (Instructions For Use).

INGREDIENTS_LABEL
type: Referenced File Type Code
label: Ingredients label
comment: The Ingredients label image is a list of ingredients printed on the packaging. It may be separated by language in multiple areas on the product.

INTERNAL_VIEW
type: Referenced File Type Code
label: Internal View
comment: The picture of the inside of a trade item mainly used for non food products (e.g., The inside of a refrigerator or the inside of a suitcase.

LIGHTING_FACT_LABEL
type: Referenced File Type Code
label: Lighting fact label
comment: Link to a file containing a visual representation of the product label containing information related to the light characteristics of the product. The lighting facts label makes it easy to compare bulb characteristics such as brightness, colour, life, and estimated operating cost for the year.

LOGO
type: Referenced File Type Code
label: Logo
comment: Link to a file containing the Manufacturer or Brand Logo(s) associated with the product.

MARKETING_INFORMATION
type: Referenced File Type Code
label: Marketing Information
comment: Link to a file with product information associated with selling a product or service.

MATERIAL_SAMPLES
type: Referenced File Type Code
label: Material Samples
comment: URL to website, images that the potential material, swatches, finishes the trade item might be available in.

MOBILE_DEVICE_IMAGE
type: Referenced File Type Code
label: Mobile Device Image
comment: Trade Item image that represents the image the manufacturer supplies to the consumer for mobile device applications. This would be a pack shot or image of the trade item that may be optimised for digital mobile display or added elements to help consumer recoginise the product. This should not be used as the Mobile Ready Hero Image. Some regulations require an actual image of the product and do not allow Mobile Ready Hero Images.

MOBILE_READY_HERO_IMAGE
type: Referenced File Type Code
label: Mobile Ready Hero Image
comment: A Mobile Ready Hero Image (MRHI) is a representation of a real world product that may differ from a standard pack shot, but that maintains the majority of the physical pack's key elements of design, shape and colour, and is therefore recognisable on a digital shelf. In addition the image should contain elements of The 4 Ws: Who is the brand, What it is, Which variety it is and how much. The Mobile Ready Hero Image (MRHI) is specified in the GS1 Mobile Ready Hero Image Guideline https://www.gs1.org/standards/Mobile-Ready-Hero-Image

MONTAGE_IMAGE
type: Referenced File Type Code
label: Montage image
comment: A Montage is the physical over layering of distinct images to create a final digital image. This process allows for a composite to be created with the future possibility of reconstruction without having to return to studio for correction, should an element be added or removed.

NUTRITION_FACT_LABEL
type: Referenced File Type Code
label: Nutrition Fact Label
comment: Link to a file containing a visual representation of the product label containing the nutritional information.

NUTRITION_FACT_LABEL_WITH_INGREDIENTS
type: Referenced File Type Code
label: Nutrition Fact Label with Ingredients
comment: Link to a file containing a visual representation of the product label containing the nutritional information with the inclusion of the ingredient statement.

OPTIMISED_HERO_IMAGE
type: Referenced File Type Code
label: Optimised hero image
comment: An Optimised Hero Image type is to support retail, consumers, distributors and foodservice operators in completing their online sites. These images will assist consumers to identify specific information about the products they are purchasing. The image is a representation of a real world product, built specifically for use on larger screens that may differ from a standard pack shot, but that maintains the majority of the physical pack's key elements of design, shape and colour, and is therefore recognisable on a digital shelf.
deprecated: OPTIMIZED_PACK_IMAGE

OPTIMIZED_PACK_IMAGE
type: Referenced File Type Code
label: Optimized pack image
comment: An Optimized Pack Image type is to support retail, consumers, distributors and foodservice operators in completing their online sites. The image is a representation of a real-world product, built specifically for use on larger screens that may differ from a standard pack shot, but that maintains the majority of the physical pack's key elements of design, shape and colour, and is therefore recognisable on a digital shelf.

ORGANIC_CERTIFICATE
type: Referenced File Type Code
label: Organic Certificate
comment: Link to a website or file containing an organic certificate granted to the product.

OTHER_EXTERNAL_INFORMATION
type: Referenced File Type Code
label: Other External Information
comment: Link to a file containing product information of an unspecified type.

OUT_OF_PACKAGE_IMAGE
type: Referenced File Type Code
label: Out of Package Image
comment: Link to an image of an item out of its packaging and, if necessary, assembled ready for use by the end user. This type of file is subject the current version of the GDSN Product Image Specification Standard.

PACKAGING_ARTWORK
type: Referenced File Type Code
label: Packaging Artwork
comment: Design files for packaging artwork for example Adobe source files.

PATIENT_INFORMATION_LEAFLET
type: Referenced File Type Code
label: Patient information leaflet
comment: A leaflet or brochure containing important information to patients/consumers about the product to facilitate discussion and assist with the decision-making process. Example: A leaflet on a medical device like a hip joint. Or a consumer/patient-focused leaflet that contains information on the safe and effective use of a medicines. Often known in some markets as Consumer Medicines Information sheet (CMI), Product Information Leaflet (PiL/ePIL).

PETFOOD_FEEDING_INSTRUCTIONS
type: Referenced File Type Code
label: Petfood Feeding Instructions
comment: Link to a file containing a visual representation of the product label containing the feeding instructions for the petfood product.

PLANOGRAM
type: Referenced File Type Code
label: Planogram
comment: Link to a file illustrating how and where retail products should be displayed.

PREPARATION_INSTRUCTIONS
type: Referenced File Type Code
label: Preparation Instructions
comment: Link to a file containing a visual representation of the product label containing the preparation instructions.

PRODUCT_FORMULATION_STATEMENT
type: Referenced File Type Code
label: Product Formulation Statement
comment: Link to a file containing the Product Formulation Statement, in lieu of a Child Nutrition Label, as formatted according to regulations and rules of an appropriate regulatory body for the target market.

PRODUCT_IMAGE
type: Referenced File Type Code
label: Product Image
comment: Link to a file containing a visual representation of the product.

PRODUCT_IMAGE_FORMED
type: Referenced File Type Code
label: Product image formed
comment: An image of a product that has the supporting shape/form (for example a model, mannequin, hanger) removed to give the product a 3-D look.

PRODUCT_LABEL_IMAGE
type: Referenced File Type Code
label: Product Label Image
comment: Link to a file containing a visual representation of the product label.

PRODUCT_WEBSITE
type: Referenced File Type Code
label: Product Website
comment: Link to a website containing product specific information. Examples of this could be a link to a website dedicated to the product or a link to the area within the manufacturer or brand owner website that contains the product information

QR_CODE
type: Referenced File Type Code
label: Link to QR Code
comment: Link to a QR code URL/URI.

QUALITY_CONTROL_PLAN
type: Referenced File Type Code
label: Quality Control Plan
comment: Document which detailed information about the quantity of laboratory/analytical tests and the evaluated parameters.

RECIPE_WEBSITE
type: Referenced File Type Code
label: Recipe Website
comment: Link to a website containing recipes associated with the product

RECYCLABILITY_ASSESSMENT_CERTIFICATE
type: Referenced File Type Code
label: Recyclability assessment certificate
comment: Link to a file containing the certificate for recyclability granted to the packaging of the item.

REGULATORY_INSPECTION_AUDIT
type: Referenced File Type Code
label: Regulatory Inspection Audit
comment: Inspection report of the inspections. For example foodstuffs, pharmaceuticals and other types of products that are regulated.

RISK_ANALYSIS_DOCUMENT
type: Referenced File Type Code
label: Risk Analysis Document
comment: Document which describes how the supplier assured the quality control of the end products or during the production process. The process can be a supplier internal control system, a simple kind of risk analysis or systematic preventive approach according Hazard Analysis and Critical Control Points (HACCP).

SAFETY_DATA_SHEET
type: Referenced File Type Code
label: Safety Data Sheet
comment: Link to a file containing the product's Safety Data Sheet (SDS). This file can be either an image or a document

SAFETY_SUMMARY_SHEET
type: Referenced File Type Code
label: Safety Summary Sheet
comment: A link to a summary sheet document that is available to workers to understand how to deal with chemicals in an emergency situation.

SAMPLE_SHIPPING_ORDER
type: Referenced File Type Code
label: Sample Shipping Order
comment: Document is a sample shipping order. A sample shipping order isn't needed for every item (GTIN), but a shipping order can differ from GTIN to GTIN. E.g. in case an item is an organic product the sample shipping order needs to contain the organic product origin number according article 31 of the implementing regulations EG Nr. 889/2008. For non-organic items this information isn't needed.

SIDEKICK_IMAGE
type: Referenced File Type Code
label: Sidekick image
comment: Retail, consumers, distributors and foodservice operators complete their online transactions using their smart devices. These images may be used to inform a customer of benefits or nutritional claims of a product. This is a supplementary image or graphic, generally used to support the Hero image.

SOCIAL_MEDIA_IMAGE
type: Referenced File Type Code
label: Social media image
comment: Trade Item image representing the image the manufacturer is supplying to the consumer to depict the social media associated to the item. This image is being shared on the social media outlet.

SUMMARY_OF_PRODUCT_CHARACTERISTICS
type: Referenced File Type Code
label: Summary of Product Characteristics
comment: Specific document required before any medicinal product or biocidal product is authorized for marketing. Example European Commission

SUPPLEMENT_FACT_LABEL
type: Referenced File Type Code
label: Supplement facts label
comment: Link to a file containing a visual representation of the product label containing information related to the supplement or nutrient product. The supplement facts label provides about what active/nutritional ingredients are used in the formula along with dosage recommendations for dietary supplements.

TECHNICAL_DATA_SHEET
type: Referenced File Type Code
label: Technical data sheet
comment: The product specification sheet, created by the manufacturer, summarises the technical characteristics and other properties of the product, relating to technological and commercial purposes. Example: https://dl.gedal.fr/docsgedal/FP/3255290252425.pdf

TECHNICAL_DRAWING
type: Referenced File Type Code
label: Technical Drawing
comment: A precise and detailed technical drawing of an object, as employed in industries such as engineering, construction, architecture etc. https://en.wikipedia.org/wiki/Engineering_drawing https://en.wikipedia.org/wiki/Technical_drawing

TESTING_METHODOLOGY_RESULTS
type: Referenced File Type Code
label: Testing Methodology Results
comment: Document which contains microbiological and physico-chemical findings of the product which are observed during product testing.

TRADE_ITEM_DESCRIPTION
type: Referenced File Type Code
label: Trade Item Description
comment: Identifies the reference to an external description of a Trade Item. The link (e.g. URL) to the external description. will be in the appropriate attribute

TRADE_ITEM_IMAGE_WITH_DIMENSIONS
type: Referenced File Type Code
label: Trade Item Image With Dimensions
comment: Link to a website, file, or image containing the product's image with its dimensions. This especially important for built-in products as ovens and fridges. Ex : http://www.docstoc.com/docs/125126778/GSS-GEW-Food-Savers-Food-Storage-Containers.

VIDEO
type: Referenced File Type Code
label: Video
comment: Link to a file containing a video clip which is relevant to the product. Examples are commercials, trailers, or instructional/ how to use video files.

VISUAL_VERIFICATION_IMAGE
type: Referenced File Type Code
label: Visual verification image
comment: Link to a file containing a visual representation of the product for the purpose of visual verification. Usage may be to examine the trade item master data against the product image. Note these images might not necessarily comply with image standards and may be restricted for a visual verification usage.

WARRANTY_INFORMATION
type: Referenced File Type Code
label: Warranty Information
comment: Link to a file with information associated with any guarantee given by a company stating that a product is reliable and free from known defects and that the seller will, without charge, repair or replace defective parts within a given time limit and under certain conditions.

WEBSITE
type: Referenced File Type Code
label: Website
comment: Link to a website containing product or manufacturer information.

ZOOM_VIEW
type: Referenced File Type Code
label: Zoom View
comment: A picture of a portion of a trade item (e.g., the wheels of a suitcase or the ingredients list of a food trade item).

AEROSOL_REVERSE_EPSILON
type: Regulation Type Code
Original Code Value: AEROSOL_REVERSE_EPSILON
comment: Products complying with all the requirements of the Aerosol Directive are marked with the "reverse epsilon" symbol.
label: Aerosol_Reverse Epsilon

AGRICULTURE_PROTECTION_REGULATION
type: Regulation Type Code
Original Code Value: AGRICULTURE_PROTECTION_REGULATION
comment: Products complying with EU Council Directive 91/414/EEC. This directive concerning the placing of plant protection products on the market lays down rules and procedures for approval of the active substances at EU-level and for the authorisation at Member State level of plant protection products (PPPs) containing these substances. This Directive states that substances cannot be used in plant protection products unless they are included in a positive EU list. Once a substance is included in the positive list Member States may authorise the use of products containing them.
label: Agriculture_Protection Regulation

ANIMAL_ID_HEALTH_MARK
type: Regulation Type Code
Original Code Value: ANIMAL_ID_HEALTH_MARK
comment: Food business operators, in accordance with Regulation (EC) No 853/2004, should ensure that all products of animal origin that they place on the market, bear either a health mark or an identification mark.
label: Animal ID Health Mark

BATTERY_DIRECTIVE
type: Regulation Type Code
Original Code Value: BATTERY_DIRECTIVE
comment: Directive describing the legal requirements on batteries intended to made available on the market provided that such products are labelled, marked or accompanied with commercial documents. Essentially safety and environmental aspects are defined (e.g. obligation of the seller to take batteries back, proscription to throw batteries into the household garbage) for different type of batteries (e.g. batteries used by the end consumer, batteries used in cars). In Germany the law on batteries (BattG) details these rules.
label: Battery Directive

BIOCIDE_REGULATION
type: Regulation Type Code
Original Code Value: BIOCIDE_REGULATION
comment: Regulation (e.g., EU Reg 528/2012) harmonising the rules on making available on the market and using biocidal products whilst ensuring a high level of protection of both human and animal health and the environment. It should not be used for trade items treated with biocidal products ('treated articles').
label: Biocide Regulation

BPA_REGULATION
type: Regulation Type Code
Original Code Value: BPA_REGULATION
comment: Indicates the product has a regulatory requirement to show to the consumer that it may or may not contain Bisphenol A (BPA).
label: BPA Regulation

BUY_AMERICAN_ACT
type: Regulation Type Code
Original Code Value: BUY_AMERICAN_ACT
comment: The Buy American Act - requires the United States government to prefer U.S.-made products in its purchases. This includes the Berry Amendment to the Act in the provisioning of products for the US Government and federal programs like National School Lunch. https://en.wikipedia.org/wiki/Buy_American_Act.
label: Buy American Act

BUY_AMERICAN_PROVISION_USDA
type: Regulation Type Code
Original Code Value: BUY_AMERICAN_PROVISION_USDA
comment: The Buy American Provision in accordance with the USDA is Section 104(d) of the William F. Goodling Child Nutrition Reauthorization Act of 1998 (Public Law 105-336) added a provision, Section 12(n) to the National School Lunch Act (NSLA) (42 USC 1760(n)), requiring school food authorities (SFAs) to purchase, to the maximum extent practicable, domestic commodities or products. This Buy American provision supports the mission of the Child Nutrition Programs, which is to serve children nutritious meals and support American agriculture. https://www.fns.usda.gov/school-meals/compliance-enforcement-buy-american.
label: Buy American Provision USDA

CE
type: Regulation Type Code
Original Code Value: CE
comment: The CE marking is the manufacturer's, distributor's or EU authorised representative's declaration that the product meets EU standards for health, safety, protection of consumers and environmental protection in accordance with the regulation. The CE mark indicates that the product may be sold freely in any part of the European Economic Area, regardless of its country of origin. The mark consists of the CE logo and, if applicable, the four-digit identification number of the notified body involved in the conformity assessment procedure.

COMPLIANT_WITH_FAIR_LABOR_STANDARDS_ACT
type: Regulation Type Code
Original Code Value: COMPLIANT_WITH_FAIR_LABOR_STANDARDS_ACT
comment: The FLSA established a national minimum wage guaranteed 'time-and-a-half' for overtime in certain jobs, and prohibited most employment of minors in "oppressive child labor," a term that is defined in the statute. It applies to employees engaged in interstate commerce or employed by an enterprise engaged in commerce or in the production of goods for commerce, unless the employer can claim an exemption from coverage.
label: Compliant With Fair Labor Standards Act

COMPLIANT_WITH_FLAMMABILITY_ACT
type: Regulation Type Code
Original Code Value: COMPLIANT_WITH_FLAMMABILITY_ACT
comment: Compliant With Flammability Act.
label: Compliant With Flammability Act

COMPLIANT_WITH_FUR_PRODUCT_LABELING_ACT
type: Regulation Type Code
Original Code Value: COMPLIANT_WITH_FUR_PRODUCT_LABELING_ACT
comment: Requires the country of origin of imported furs to be disclosed on all labels and in all advertising.
label: Compliant With Fur Product Labeling Act

COMPLIANT_WITH_STATE_ENVIRONMENT_REQUIREMENTS
type: Regulation Type Code
Original Code Value: COMPLIANT_WITH_STATE_ENVIRONMENT_REQUIREMENTS
comment: NOT AVAILABLE
label: Compliant With State Environment Requirements

COMPLIANT_WITH_TEXTILE_FIBER_PRODUCT_IDENTIFICATION
type: Regulation Type Code
Original Code Value: COMPLIANT_WITH_TEXTILE_FIBER_PRODUCT_IDENTIFICATION
comment: A US regulation regarding the advertising and labelling of textile fibre products.
label: Compliant With Textile Fiber Product Identification

COMPLIANT_WITH_WOOL_PRODUCTS_LABELING_ACT
type: Regulation Type Code
Original Code Value: COMPLIANT_WITH_WOOL_PRODUCTS_LABELING_ACT
comment: A US regulation that requires anyone who manufacturers or sells products containing wool to accurately label each item with the fibre content and origin.
label: Compliant With Wool Products Labeling Act

CONSUMER_PRODUCT_SAFETY
type: Regulation Type Code
Original Code Value: CONSUMER_PRODUCT_SAFETY
comment: A regulation concerning consumer product safety when a government regulates certain products for safety like child car seats, baby cribs etc., For example in the US Consumer Product Safety Commission (CPSC): official Federal Agency including recalls, reports, alerts about products regulated.
label: Consumer_Product Safety

CONTAINS_COMPOSITE_WOOD
type: Regulation Type Code
Original Code Value: CONTAINS_COMPOSITE_WOOD
comment: Describes that the trade item or packaging contains composite wood that falls under regulatory menas due to chemicals used in process to create the wood, such as Formaldehyde has both cancer and noncancer-causing effects on human health. For example: California Air Resources Board is a department of the California Environmental Protection Agency. CARB's mission, US EPA. https://www.epa.gov/formaldehyde .
label: Contains Composite Wood

COSMETIC_INFORMATION_REGULATION
type: Regulation Type Code
Original Code Value: COSMETIC_INFORMATION_REGULATION
comment: Regulation (EU Reg 1223/2009) establishing rules to be complied with any cosmetic product made available on the market, a high level of protection of human health and a high degree of protection of the environment. These rules include the necessity to indicate allergens and the displaying of the ingredients used in the product.
label: Cosmetic_Information Regulation

DECLARATION_OF_PERFORMANCE_REQUIRED
type: Regulation Type Code
Original Code Value: DECLARATION_OF_PERFORMANCE_REQUIRED
comment: A Declaration Of Performance (DOP) is legally required. See target market regulations for applicability.
label: Declaration of performance (DOP) required

DEFORESTATION_REGULATION
type: Regulation Type Code
Original Code Value: DEFORESTATION_REGULATION
comment: Regulation minimising the contribution to deforestation and forest degradation worldwide, and thereby contributing to a reduction in global deforestation; reducing the contribution to greenhouse gas emissions and global biodiversity loss (e.g., EU regulation 2023/1115).
label: Deforestation regulation

DETERGENTS_SAFETY_REGULATION
type: Regulation Type Code
Original Code Value: DETERGENTS_SAFETY_REGULATION
comment: Regulation establishing rules designed to achieve the free movement of detergents and surfactants for detergents in the market while, at the same time, ensuring a high degree of protection of the environment and human health. For example (EU Reg 648/2004)
label: Detergents_Safety Regulation

EFFICIENCY_OF_LAMPS_LUMINARIES
type: Regulation Type Code
Original Code Value: EFFICIENCY_OF_LAMPS_LUMINARIES
comment: A directive defining the energy labeling of electrical lamps and luminaires (e.g. EU Reg 874/2012). This directive deals with environmental aspects as the electricity used by electrical lamps accounts for a significant share of total electricity demand.
label: Efficiency of Lamps Luminaries

EMC_DIRECTIVE
type: Regulation Type Code
Original Code Value: EMC_DIRECTIVE
comment: The main objective of the Directive 2004/108/EC of the European Council, of 15 December 2004, is to regulate the compatibility of equipment regarding EMC (Electromagnetic Compatibility).
label: EMC Directive

ENCLOSED_ATTACHED_INFORMATION
type: Regulation Type Code
Original Code Value: ENCLOSED_ATTACHED_INFORMATION
comment: Indicates the product contains enclosed or attached information available for regulatory compliance where applicable.
label: Enclosed Attached Information

ENERGY_GUIDE_LABEL_REQUIRED
type: Regulation Type Code
Original Code Value: ENERGY_GUIDE_LABEL_REQUIRED
comment: A code indicating that a trade item is in compliance with energy efficiency guide and is labelled as such.
label: Energy Guide Label Required

EU_REGULATION_FOR_FOODSTUFF
type: Regulation Type Code
Original Code Value: EU_REGULATION_FOR_FOODSTUFF
comment: Regulation (EC) No 178/2002 of the European Parliament and of the Council of 28 January 2002 laying down the general principles and requirements of food law, establishing the European Food Safety Authority and laying down procedures in matters of food safety. For the purposes of this Regulation, "food" (or "foodstuff") means any substance or product, whether processed, partially processed or unprocessed, intended to be, or reasonably expected to be ingested by humans. "Food" includes: drink, chewing gum and any substance, including water, intentionally incorporated into the food during its manufacture, preparation or treatment. It includes water after the point of compliance.
label: EU Regulation Label Required

EXPLOSIVES_PRECURSORS_REGISTRATION
type: Regulation Type Code
Original Code Value: EXPLOSIVES_PRECURSORS_REGISTRATION
comment: The product is concerned with the marketing and use of explosives precursors and must be registered by the economic operator. Explosives precursors are chemical substances that can be used for legitimate purposes, but that can also be misused to manufacture homemade explosives. For example restricted explosive precursors listed in Annex I of the Regulation (EU) No 2019/1148.
label: Restricted explosive precursors

EXPLOSIVES_PRECURSORS_REPORTING
type: Regulation Type Code
Original Code Value: EXPLOSIVES_PRECURSORS_REPORTING
comment: The product is concerned with the marketing and use of explosives precursors and must be reported by the economic operator. Explosives precursors are chemical substances that can be used for legitimate purposes, but that can also be misused to manufacture homemade explosives. For example reportable explosive precursors listed in Annex II of the Regulation (EU) No 2019/1148.
label: Reportable explosive precursors

E_MARK
type: Regulation Type Code
Original Code Value: E_MARK
comment: The Estimated Sign (℮) (also referred to as "e-mark") is a mark that sometimes can be found on pre-packed goods in Europe. The e-mark indicates that the packaging is filled according to the European Directive 76/211/EEC.
label: E-mark

FEED_SAFETY_REGULATION
type: Regulation Type Code
Original Code Value: FEED_SAFETY_REGULATION
comment: Regulation (EU Reg 767/2009) to harmonise the conditions for the placing on the market and the use of feed, in order to ensure a high level of feed safety and thus a high level of protection of public health, as well as to provide adequate information for users and consumers.
label: Feed_Safety Regulation

FOOD_FOR_SPECIAL_PURPOSES
type: Regulation Type Code
Original Code Value: FOOD_FOR_SPECIAL_PURPOSES
comment: Regulation providing the basis for the assurance of a high level of consumer protection in relation to specialized food like food for infants and young children, food for special medical purposes, and total diet replacement for weight control (e.g. EU Reg 609/2013).
label: Food For Special Purposes

FOOD_INFORMATION_REGULATION
type: Regulation Type Code
Original Code Value: FOOD_INFORMATION_REGULATION
comment: Regulation providing the basis for the assurance of a high level of consumer protection in relation to food information, taking into account the differences in the perception of consumers and their information needs whilst ensuring the smooth functioning of the market. General principles, requirements and responsibilities governing food information, and in particular food labelling rules are established (e.g. EU regulation 1169 / 2011). These rules include the necessity to indicate allergens, the responsible food business operator, the name of the food, the displaying of the ingredients used additives.
label: Food_Information Regulation

FOOD_LABELLING_UNDER_2_YEARS_OF_AGE
type: Regulation Type Code
Original Code Value: FOOD_LABELLING_UNDER_2_YEARS_OF_AGE
comment: Foods, other than infant formula, represented or purported to be specifically for infants and children less than 2 years of age shall bear nutrition labelling.
label: Food Labelling Under 2 Years of Age

FOOD_LABELLING_UNDER_4_YEARS_OF_AGE
type: Regulation Type Code
Original Code Value: FOOD_LABELLING_UNDER_4_YEARS_OF_AGE
comment: Foods, other than infant formula, represented or purported to be specifically for infants and children less than 4 years of age shall bear nutrition labelling.
label: Food Labelling Under 4 Years of Age

FOOD_SUPPLEMENT_DIRECTIVE
type: Regulation Type Code
Original Code Value: FOOD_SUPPLEMENT_DIRECTIVE
comment: Food supplements (EU directive 2002/46/EC) marketed as foodstuffs and presented as such. These products shall be delivered to the ultimate consumer only in a pre-packaged form. Consumer health and safety aspects are in focus as well as to provide adequate information on how to use the product properly.
label: Food_Supplement Directive

FREE_PHARMACEUTICAL_PRODUCTS_DIRECTIVE
type: Regulation Type Code
Original Code Value: FREE_PHARMACEUTICAL_PRODUCTS_DIRECTIVE
comment: Directive describing the legal requirements on pharmaceutical products which are commercially available and intended to made available on the market provided that such products are labelled, marked or accompanied with commercial documents. General Consumer safety aspects are in focus like the dosage form linked with an application instruction (e.g. Do not use with alcohol). In Germany the law on medical products (AMG) details these rules.
label: Free Pharmaceutical Products Directive

FRENCH_SPARE_PARTS_REGULATION
type: Regulation Type Code
Original Code Value: FRENCH_SPARE_PARTS_REGULATION
comment: Decree No. 2014-1482 of 9 December 2014 on the information and supply obligations concerning spare parts indispensable for the use of a good
label: French Spare Parts Regulation

HAZARDS_CLASSIFICATION_LABELLING_REGULATION
type: Regulation Type Code
Original Code Value: HAZARDS_CLASSIFICATION_LABELLING_REGULATION
comment: Regulation providing the basis to ensure that workers and consumers are clearly informed of the hazards associated with chemicals by means of a system of classification and labelling. The aim is to ensure that the same hazards are described and labelled in the same way in all concerned countries (e.g. Regulation (EC) No 1272/2008 of the European Parliament and of the Council of 16 December 2008 on Classification, Labelling and Packaging (CLP) of substances and mixtures).
label: Hazards classification, labelling and packaging regulation

HERBICIDE_REGULATION
type: Regulation Type Code
Original Code Value: HERBICIDE_REGULATION
comment: The item is a substance used to control unwanted plants that are subject to regulation.
label: Herbicide Regulation

INFANT_FORMULA_LABELLING
type: Regulation Type Code
Original Code Value: INFANT_FORMULA_LABELLING
comment: Infant formula except foods, shall be labelled in compliance with regulations.
label: Infant formula Labelling

INTENDED_TO_COME_INTO_CONTACT_WITH_FOOD
type: Regulation Type Code
Original Code Value: INTENDED_TO_COME_INTO_CONTACT_WITH_FOOD
comment: Requires that food contact materials a re safe; Must not transfer their components into food in quantities that could endanger human health, change food composition in an unacceptable way or deteriorate its taste and odour. Are manufactured according to good manufacturing practice.
label: Intended to Come Into Contact with Food

LVD_DIRECTIVE
type: Regulation Type Code
Original Code Value: LVD_DIRECTIVE
comment: The Low Voltage Directive (LVD) 2006/95/EC provides common broad objectives for safety regulations, so that electrical equipment approved by any EU member country will be acceptable for use in all other EU countries. The Low Voltage Directive does not supply any specific technical standards that must be met, instead relying on IEC technical standards to guide designers to produce safe products. Products that conform to the general principles of the Low Voltage Directive and the relevant particular safety standards are marked with the CE marking to indicate compliance and acceptance throughout the EU. Conformance is asserted by the manufacturer based on its conformity assessment.
label: LVD Directive

MARKET_AUTHORISATION
type: Regulation Type Code
Original Code Value: MARKET_AUTHORISATION
comment: The trade item has been authorised to be sold by a regulatory agency to be distributed in a market.
label: Market Authorisation

MEDICAL_DEVICE_SAFETY
type: Regulation Type Code
Original Code Value: MEDICAL_DEVICE_SAFETY
comment: A directive establishing common rules on the safety, health protection and performance characteristics of medical devices in order to provide the safety and health protection of patients, users and, where appropriate, other persons, with regard to the use of medical devices ((e.g. Medical Device Regulation (EU) 2017/745) and in-vitro diagnostic devices (e.g. In vitro Diagnostic Device Regulation (EU) 2017/746)). .
label: Medical_Device Safety

MINIMUM_DURABILITY
type: Regulation Type Code
Original Code Value: MINIMUM_DURABILITY
comment: Indicates the product has a regulatory requirement to show to the consumer the best to use before period so they obtain the full functionality of the product.
label: Minimum Durability

NANO_MATERIALS_PRESENCE
type: Regulation Type Code
Original Code Value: NANO_MATERIALS_PRESENCE
comment: Indicates the presence of nano materials by the levels acceptable by the appropriate regulation. Note: in Europe, use code NANOPARTICLE in attribute claimElementCode instead.
label: Nano materials presence

NOT_APPLICABLE
type: Regulation Type Code
Original Code Value: NOT_APPLICABLE
comment: Not Applicable.
label: Not Applicable

PACKAGING_SAFETY_DIRECTIVE
type: Regulation Type Code
Original Code Value: PACKAGING_SAFETY_DIRECTIVE
comment: The product represented in its packaging and/or marketing as appropriate for use by persons as defined by regulatory agency? Includes packaging, display, photography, licensed characters, promotion or advertising (in-store or ad) as appropriate for use by persons. An example is the Consumer Product Safety Commission regulation: https://www.cpsc.gov/Regulations-Laws--Standards/Statutes/Poison-Prevention-Packaging-Act/Child-Resistant-and-Senior-Friendly-Packages-packaging-guide/.
label: Packaging Safety Directive

PERIOD_SAFE_TO_USE_AFTER_OPENING
type: Regulation Type Code
Original Code Value: PERIOD_SAFE_TO_USE_AFTER_OPENING
comment: Indicates the product has a regulatory requirement to show to the consumer that product is denoted to have a period of time after opening before it becomes harmful to the consumer.
label: Period Safe To Use After Opening

PESTICIDE_REGULATION
type: Regulation Type Code
Original Code Value: PESTICIDE_REGULATION
comment: The item is a substance used to control unwanted pests that are subject to regulation.
label: Pesticide Regulation

PHARMACEUTICAL_PRODUCT_DIRECTIVE
type: Regulation Type Code
Original Code Value: PHARMACEUTICAL_PRODUCT_DIRECTIVE
comment: In contrast to the free pharmaceutical directive this directive describing the legal requirements on pharmaceutical products available only in pharmacies. These products have stronger regulations and restrictions to consumer safety aspects. For example the dosage recommendation needs to be explained in detail by the sales staff as well as possible interaction with other pharmaceutical products.
label: Pharmaceutical_Product Directive

PLASTIC_DIRECTIVE
type: Regulation Type Code
Original Code Value: PLASTIC_DIRECTIVE
comment: Directive on the reduction of the impact of certain plastic products on the environment (e.g., directive (EU) 2019/904).
label: Plastic directive

PRODUCT_LABELING_REGULATION
type: Regulation Type Code
Original Code Value: PRODUCT_LABELING_REGULATION
comment: A code indicating the trade item is compliant with the food labelling regulation.
label: Product Labelling Regulation

PRODUCT_OF_DAILY_USE_DIRECTIVE
type: Regulation Type Code
Original Code Value: PRODUCT_OF_DAILY_USE_DIRECTIVE
comment: Directive describing the legal requirements on the products of daily use focusing on consumer safety (e.g. do not use with …, not used by children). An example is the German directive BedGgstV.
label: Product of Daily Use Directive

PROP_65
type: Regulation Type Code
Original Code Value: PROP_65
comment: Containing specific toxicants for a product which contains carcinogens and/or reproductive toxicants established in California's Proposition 65 (Prop 65), The Safe Drinking Water and Toxic Enforcement Act, enacted in 1986. This Act requires the state to publish a list of chemicals known to cause cancer or reproductive harm. Prop 65 applies to suppliers who sell products in the state if their products exceed safe harbour levels established in Prop 65. Safe harbour levels establish thresholds for no significant risk levels (NSRLs) for carcinogens and maximum allowable dose levels (MADLs) for chemicals that cause reproductive toxicity.
label: Proposition 65 (Prop 65) [US California]

REGULATED_BY_AGENCY
type: Regulation Type Code
Original Code Value: REGULATED_BY_AGENCY
comment: The trade item is regulated by the agency stated in the regulatoryAgency attribute.
label: Regulated by Agency

RETURNING_OF_ELECTRONICAL_PRODUCT_DIRECTIVE
type: Regulation Type Code
Original Code Value: RETURNING_OF_ELECTRONICAL_PRODUCT_DIRECTIVE
comment: Directive of the returning of electronic products ensuring a high degree of protection of the environment. This directive defines returning quotes of returning electronical products needs to be fulfilled by the industry and by retailers (e.g. ElektroG in Germany).
label: Returning of Electronic Product Directive

ROHS_DIRECTIVE
type: Regulation Type Code
Original Code Value: ROHS_DIRECTIVE
comment: Is not a quality mark but a European directive 2002/95/EC (stands for Restriction of Hazardous Substances). This directive restricts (with exceptions) the use of six hazardous materials like lead, cadmium and mercury in the manufacture of various types of electronic and electrical equipment.
label: ROHS Directive

SAFETY_DATA_SHEET_REQUIRED
type: Regulation Type Code
Original Code Value: SAFETY_DATA_SHEET_REQUIRED
comment: A Safety Data Sheet (SDS) is legally required. See target market regulations for applicability.
label: Safety data sheet required

SCATTERED_POLLUTION_REGULATION
type: Regulation Type Code
Original Code Value: SCATTERED_POLLUTION_REGULATION
comment: Decree No. 2011-1650 of 25 November 2011 on the procedures for declaring and paying back the non-point pollution charge and for keeping the registers referred to in Articles L. 254-3-1 and L. 254-6 of the Rural and Maritime Fisheries Code.
label: Scattered pollution regulation

SECURITY_OF_ELECTRONIC_PRODUCTS_DIRECTIVE
type: Regulation Type Code
Original Code Value: SECURITY_OF_ELECTRONIC_PRODUCTS_DIRECTIVE
comment: Directive on the safety of electronic products covering consumer health as well as environmental aspects (e.g. German law on product safety ProdSG).
label: Security of Electronic Products Directive

SMALL_PARTS
type: Regulation Type Code
Original Code Value: SMALL_PARTS
comment: A small part is any object that fits completely into a specified size by regulation that approximates the size of the fully expanded throat of a child of age specified by regulation. A small part can be a whole toy or article, a Separate part of a toy, game, or other article or a piece of a toy or article that breaks off during testing that simulates use or abuse by children. Example in US See 16 C.F.R. 1501.4.
label: Small Parts Regulation

TEXTILE_LABELLING_REGULATION
type: Regulation Type Code
Original Code Value: TEXTILE_LABELLING_REGULATION
comment: Regulation (EU Reg 1007/2011). This Regulation lays down rules concerning the use of textile fibre names and related labelling and marking of fibre composition of textile products, rules concerning the labelling or marking of textile products containing non-textile parts of animal origin and rules concerning the determination of the fibre composition of textile products by quantitative analysis of binary and ternary textile fibre mixtures, in order to provide accurate information to consumers.
label: Textile labelling regulation

TOBACCO_DIRECTIVE
type: Regulation Type Code
Original Code Value: TOBACCO_DIRECTIVE
comment: The directive or regulation aims to improve the functioning of tobacco products within a market while ensuring a high level of public health protection. Example: European Directive 2014/40/EU on the manufacture, presentation and sale of cigarettes, roll-your-own tobacco, pipe tobacco, cigars, cigarillos, smokeless tobacco products, electronic cigarettes and plant-smoked products.
label: Tobacco Directive

TOY_SAFETY_DIRECTIVE
type: Regulation Type Code
Original Code Value: TOY_SAFETY_DIRECTIVE
comment: Directive, which applies to products designed or intended, whether or not exclusively, for use in play by children under 14 years of age. Health and safety aspects of the child are in focus Amongst others security aspects of toys are defined (e.g. Warning: small components may be swallowed) as well as substances, which are not allowed to use in toys (e.g. softening agents).
label: Toy safety directive

TRACEABILITY_REGULATION
type: Regulation Type Code
Original Code Value: TRACEABILITY_REGULATION
comment: Indicates that a trade item is subject to government rules and regulations regarding traceability.
label: Traceability Regulation

TRADE_ITEM_CONSIDERED_UNPACKED
type: Regulation Type Code
Original Code Value: TRADE_ITEM_CONSIDERED_UNPACKED
comment: The trade item is considered as unpacked by regulation, even if physical packaging may exist. (E.g. European Regulation on fresh fruit & vegetables EU 1169, EU 543, EU 852)
label: Trade item considered unpacked

TRADE_ITEM_TESTED_DIRECTIVE
type: Regulation Type Code
Original Code Value: TRADE_ITEM_TESTED_DIRECTIVE
comment: The product has conformed to testing requirements to meet regulation needs. An example is the Consumer Product Safety Commission https://www.cpsc.gov/Regulations-Laws--Standards/Statutes/The-Consumer-Product-Safety-Improvement-Act/.
label: Trade Item Tested Directive

TREATED_WITH_BIOCIDE_REGULATION
type: Regulation Type Code
Original Code Value: TREATED_WITH_BIOCIDE_REGULATION
comment: Regulation (e.g., EU Reg 528/2012) harmonising the rules on making available on the market and trade items treated with biocidal products ('treated articles'), whilst ensuring a high level of protection of both human and animal health and the environment. It should not be used for biocidal products.
label: Biocide regulation treated article

TREATED_WITH_HERBICIDE_REGULATION
type: Regulation Type Code
Original Code Value: TREATED_WITH_HERBICIDE_REGULATION
comment: Trade item has been treated with herbicide(s) that are subject to regulation.
label: Treated with Herbicide Regulation

TREATED_WITH_PESTICIDE_REGULATION
type: Regulation Type Code
Original Code Value: TREATED_WITH_PESTICIDE_REGULATION
comment: Trade item has been treated with pesticide(s) that are subject to regulation.
label: Treated with Pesticide Regulation.

UK_CONFORMITY_ASSESSED
type: Regulation Type Code
Original Code Value: UK_CONFORMITY_ASSESSED
comment: The UKCA (UK Conformity Assessed) marking is the UK product marking required for goods being placed on the market in Great Britain (England, Wales and Scotland) fully replacing the European CE marking from 1 January 2023. The UK CA marking supports fair competition by holding all companies accountable to the same rules. Reference: https://www.gov.uk/guidance/uk-conformity-assessment and https://www.gov.uk/guidance/using-the-ukca-marking.
label: UK Conformity Assessed

UNDERWATER_LIGHTING
type: Regulation Type Code
Original Code Value: UNDERWATER_LIGHTING
comment: The European standard EN 60598-2-18 is recognized by most countries as the safety standard for underwater lighting.
label: Underwater Lighting

UNSPECIFIED
type: Regulation Type Code
Original Code Value: UNSPECIFIED
comment: Unspecified.
label: Unspecified

UVA
type: Regulation Type Code
Original Code Value: UVA
comment: EU 647 Cosmetic industry worked closely with the European Commission, and COLIPA, currently called COSMETICS EUROPE proposed a UVA labelling symbol. This indicates that the level of UVA protection provided by a product is at least 1/3 ratio of its SPF. Manufacturers will show that their products meet the SPF/UVAPF ratio by displaying the letters “UVA” inside a circle whose diameter should not exceed the height of the SPF number.
label: Uva

VEHICLE_LICENSE_PLATE_REGISTRATION
type: Regulation Type Code
Original Code Value: VEHICLE_LICENSE_PLATE_REGISTRATION
comment: Provides proof of the registered motorized vehicle plate number.
label: Vehicle License Plate Registration

VEHICLE_LIGHTING_COMPLIANT
type: Regulation Type Code
Original Code Value: VEHICLE_LIGHTING_COMPLIANT
comment: Vehicle lighting meets regulatory compliance in road and off road safety. Example in the US is SAE-DOT.
label: Vehicle Lighting Compliant

VOLATILE_ORGANIC_COMPOUND_COMPLIANT
type: Regulation Type Code
Original Code Value: VOLATILE_ORGANIC_COMPOUND_COMPLIANT
comment: Organic chemicals that have a high vapor pressure at ordinary, room-temperature conditions. Their high vapor pressure results from a low boiling point, which causes large numbers of molecules to evaporate or sublimate from the liquid or solid form of the compound and enter the surrounding air.
label: Volatile Organic Compound Compliant

WARRANTY_REQUIREMENTS
type: Regulation Type Code
Original Code Value: WARRANTY_REQUIREMENTS
comment: Requirements which specify the product's warranty type (i.e., implied, express, etc.) and any terms and conditions applicable. Please refer to local regulations.
label: Warranty requirements

DUE_DILIGENCE_STATEMENT
type: Regulatory Identifier Type
Original Code Value: DUE_DILIGENCE_STATEMENT
comment: A document or dataset that states the due diligence activities undertaken by a person or organization to meet regulatory compliance requirements.
label: Due Diligence Statement

RelativeHumidity
type: Measurement type
label: Relative humidity
comment: The ratio of the partial pressure of water vapour in an an air-water mixture to the saturated vapour pressure of water at a prescribed temperature. Typically expressed as a percentage.

Resistance
type: Measurement type
comment: The ratio of the potential difference across an electrical component to the current passing through it. It is a measure of the opposition to the flow of electric charge. The real part of the impedance, characterised by the dissipation of energy as opposed to its storage. SI Units: ohm

Resistivity
type: Measurement type
comment: A measure of how strongly a material resists the flow of electric current. The electric field required to achieve unit current density flowing through the material. SI Units: ohm metre

ALL_YEAR
type: Season Parameter Code
comment: All Year
label: All Year

AUTUMN
type: Season Parameter Code
comment: For products that are seasonal in nature and apply to the Autumn selling season only
label: Autumn

AUTUMN_WINTER
type: Season Parameter Code
comment: For products that are seasonal in nature and apply to both the Autumn and Winter selling seasons
label: Autumn and Winter

SPRING
type: Season Parameter Code
comment: For products that are seasonal in nature and apply to the Spring selling season only
label: Spring

SPRING_SUMMER
type: Season Parameter Code
comment: For products that are seasonal in nature and apply to both the Spring and Summer selling seasons
label: Spring and Summer

SUMMER
type: Season Parameter Code
comment: For products that are seasonal in nature and apply to the Summer selling season only
label: Summer

WINTER
type: Season Parameter Code
comment: For products that are seasonal in nature and apply to the Winter selling season only
label: Winter

HOLOGRAM
type: Security Marking code list
comment: A holographic image formed using light diffraction and interference of light waves, capable of representing a three-dimensional object or multiple images, depending on the angle of observation.
label: hologram

MICROPRINTING
type: Security Marking code list
comment: A hidden pattern that is too small to read easily without means of optical magnification such as a microscope
label: microprinting

UVINK
type: Security Marking code list
comment: A hidden pattern or marking that is invisible when observed under normal visible light but which fluoresces when observed using ultra-violet light
label: ultra-violet fluorescent ink

WATERMARK
type: Security Marking code list
comment: A conventional watermark in which a pattern within a translucent sheet becomes visible when observed via transmitted light (typically due to reduced opacity of the pattern), whereas the pattern remains hidden when observed via light reflected off the surface
label: watermark

EXTRA_EXTRA_SHARP
type: Sharpness of Cheese Code
label: Extra Extra Sharp

EXTRA_SHARP
type: Sharpness of Cheese Code
label: Extra Sharp

MILD
type: Sharpness of Cheese Code
label: Mild

REGULAR
type: Sharpness of Cheese Code
label: Regular

SHARP
type: Sharpness of Cheese Code
label: Sharp

UNCLASSIFIED
type: Sharpness of Cheese Code
label: Unclassified

BOYS
type: Size Group Code
label: Boys

GIRLS
type: Size Group Code
label: Girls

INFANTS
type: Size Group Code
label: Infants

JUNIORS
type: Size Group Code
label: Juniors

MATERNITY
type: Size Group Code
label: Maternity

MENS
type: Size Group Code
label: Mens

MENS_TALL
type: Size Group Code
label: Mens Tall

MISSES
type: Size Group Code
label: Misses

PETITE
type: Size Group Code
label: Petite

WOMENS
type: Size Group Code
label: Womens

WOMENS_TALL
type: Size Group Code
label: Womens Tall

AUSTRALIA
type: Size System Code
label: Australia

CONTINENTAL
type: Size System Code
label: Continental

EUROPE
type: Size System Code
label: Europe

JAPAN
type: Size System Code
label: Japan

MEXICO
type: Size System Code
label: Mexico

UK
type: Size System Code

US
type: Size System Code

BACK
type: Size Type Code
label: Back

CHEST_BUST
type: Size Type Code
comment: The measurement around the widest part of the chest/bust.
label: Chest or Bust

COLLAR
type: Size Type Code
label: Collar

CUP
type: Size Type Code
label: Cup

HIPS
type: Size Type Code
comment: The measurement around the fullest part of the hips.
label: Hips

INSEAM
type: Size Type Code
label: Inseam

LENGTH
type: Size Type Code
label: Length

ONE_DIMENSION
type: Size Type Code
label: One Dimension

OUTSIDE_LEG
type: Size Type Code
comment: The measurement of the outside leg seam. This is the distance from the waist to the bottom of the trousers.
label: Outside Leg

SLEEVE
type: Size Type Code
label: Sleeve

WAIST
type: Size Type Code
label: Waist

WIDTH
type: Size Type Code
label: Width

SolidAngle
type: Measurement type
label: Solid angle
comment: A three-dimensional equivalent to planar angle, indicating a measure of the field of view subtended by an object when viewed from a specified point, the apex. The solid angle is the surface area subtended at radius r from the apex divided by the square of that radius r. SI Units: steradian etc.

ALLIGATOR
type: Source Animal Code
comment: A crocodilian in the genus Alligator of the family Alligatoridae.
label: Alligator

ASS
type: Source Animal Code
comment: A domesticated member of the horse family.
label: Ass

BEAR
type: Source Animal Code
comment: Mammals of the family Ursidae.
label: Bear

BEEF_COW
type: Source Animal Code
comment: Cattle raised principally for meat production, other uses include leather and products used in shampoo and cosmetics.
label: Beef Cow

BOAR
type: Source Animal Code
comment: A wild relative of the domestic pig.
label: Boar

BUFFALO
type: Source Animal Code
comment: A large bovine animal, frequently used as livestock.
label: Buffalo

CALF
type: Source Animal Code
comment: A general term for a juvenile member of any species of domestic cattle which is intentionally raised to be processed at a young age.
label: Calf

CAMEL
type: Source Animal Code
comment: Even-toed ungulates within the genus Camelus.
label: Camel

CHICKEN
type: Source Animal Code
comment: A domesticated fowl.
label: Chicken

COCKEREL
type: Source Animal Code
comment: A male chicken.
label: Cockerel

COW
type: Source Animal Code
comment: A domesticated member of the subfamily Bovinae.
label: Cow

CROCODILE
type: Source Animal Code
comment: Any species belonging to the family Crocodylidae.
label: Crocodile

DEER
type: Source Animal Code
comment: Ruminant mammals forming the family Cervidae.
label: Deer

DOG
type: Source Animal Code
comment: A domesticated form of the Wolf, a member of the Canidae family of the order Carnivora.
label: Dog

DUCK
type: Source Animal Code
comment: Aquatic birds, mostly smaller than the swans and geese, and may be found in both fresh water and sea water.
label: Duck

DUCKLING
type: Source Animal Code
comment: A young duck.
label: Duckling

FISH
type: Source Animal Code
comment: Fresh or sea water fish.
label: Fish

FOWL
type: Source Animal Code
comment: Non-domesticated birds in general but usually refers to birds belonging to one of two biological orders, namely the gamefowl or landfowl and the waterfowl.
label: Fowl

FROG
type: Source Animal Code
comment: Amphibians in the order Anura.
label: Frog

GOAT
type: Source Animal Code
comment: A member of the Bovidae family and is closely related to the sheep.
label: Goat

GOOSE
type: Source Animal Code
comment: A bird belonging to the family Anatidae
label: Goose

GROUSE
type: Source Animal Code
comment: A group of birds from the order Galliformes.
label: Grouse

GUINEAFOWL
type: Source Animal Code
comment: A family of birds in the Galliformes order
label: Guinea Fowl

HARE
type: Source Animal Code
comment: Leporidaes belonging to the genus Lepus.
label: Hare

HORSE
type: Source Animal Code
comment: a hoofed (ungulate) mammal, a subspecies of one of seven extant species of the family Equidae.
label: Horse

INVERTEBRATE
type: Source Animal Code
comment: Fresh or sea water invertebrate.
label: Invertebrate

LAMB
type: Source Animal Code
comment: A young domestic sheep.
label: Lamb

LAND_SNAIL
type: Source Animal Code
comment: A member of the molluscan class Gastropoda that have coiled shells in the adult stage and live on land.
label: Land Snail

MILK_COW
type: Source Animal Code
comment: Also referred to Milk Cattle, this cow is bred to produce large quantities of Milk, from which dairy products are made.
label: Milk Cow

MOOSE
type: Source Animal Code
comment: The largest extant species in the deer family.
label: Moose

OSTRICH
type: Source Animal Code
comment: Large flightless bird native to Africa.
label: Ostrich

OTHER
type: Source Animal Code
comment: Other animal not specified on this list.
label: Other

PARTRIDGE
type: Source Animal Code
comment: Medium-sized birds, intermediate between the larger pheasants and the smaller quails.
label: Partridge

PHEASANT
type: Source Animal Code
comment: A bird in the subfamily of Phasianidae in the order Galliformes.
label: Pheasant

PIGEON
type: Source Animal Code
comment: A bird in the family Columbidae.
label: Pigeon

PORK
type: Source Animal Code
comment: Meat from the domestic pig
label: Pork

POUSSIN
type: Source Animal Code
comment: A young chicken, less than 28 days old at slaughter
label: Poussin

QUAIL
type: Source Animal Code
comment: Several genus of mid-sized birds in the pheasant family.
label: Quail

RABBIT
type: Source Animal Code
comment: Small mammals in the family Leporidae of the order Lagomorpha
label: Rabbit

RAT
type: Source Animal Code
comment: Rats are various medium-sized, long-tailed rodents of the superfamily Muroidea.
label: Rat

REINDEER
type: Source Animal Code
comment: An Arctic and Subarctic-dwelling deer, widespread and numerous across the Arctic and Subarctic.
label: Reindeer

ROE_DEER
type: Source Animal Code
comment: A deer species of Europe, Asia Minor, and Caspian coastal regions.
label: Roe Deer

SHEEP
type: Source Animal Code
comment: Small ruminants, usually with a crimped hair called wool and often with horns forming a lateral spiral.
label: Sheep

SHELLFISH
type: Source Animal Code
comment: A fresh or sea water animal, such as a mollusk or crustacean, that has a shell or shell-like exoskeleton.
label: Shellfish

SNAKE
type: Source Animal Code
comment: Elongate legless carnivorous reptiles of the suborder Serpentes.
label: Snake

SNIPE
type: Source Animal Code
comment: Any of nearly 20 wading bird species in three genera in the family Scolopacidae.
label: Snipe

SPARROW
type: Source Animal Code
comment: Small passerine birds in the family Passeridae.
label: Sparrow

THRUSH
type: Source Animal Code
comment: Plump, soft-plumaged, small to medium-sized passerine birds.
label: Thrush

TURKEY
type: Source Animal Code
comment: A large bird in the genus Meleagris.
label: Turkey

TURTLE
type: Source Animal Code
comment: Reptiles characterised by a special bony or cartilaginous shell developed from their ribs that acts as a shield.
label: Turtle

WOODCOCK
type: Source Animal Code
comment: The woodcocks are a group of seven or eight very similar living species of wading birds in the genus Scolopax.
label: Woodcock

YAK
type: Source Animal Code
comment: A long-haired bovine found throughout the Himalayan region of south Central Asia, the Tibetan Plateau and as far north as Mongolia.
label: Yak

SpecificVolume
type: Measurement type
label: Specific volume
comment: The volume of a substance per unit mass. The reciprocal of density. SI Units: cubic metres per kilogram

Speed
type: Measurement type
label: Speed or Velocity
comment: The ratio of the linear distance travelled by a body to the time taken. Speed is a scalar quantity. Velocity is a vector with magnitude and direction. SI Units: metre per second

AMERICAN_FOOTBALL
type: Sporting Activity Type Code
label: American Football

ARCHERY
type: Sporting Activity Type Code
label: Archery

BADMINTON
type: Sporting Activity Type Code
label: Badminton

BASEBALL
type: Sporting Activity Type Code
label: Baseball

BASKETBALL
type: Sporting Activity Type Code
label: Basketball

BOXING
type: Sporting Activity Type Code
label: Boxing

CLIMBING
type: Sporting Activity Type Code
label: Climbing

CRICKET
type: Sporting Activity Type Code
label: Cricket

CYCLING
type: Sporting Activity Type Code
label: Cycling

DIVING
type: Sporting Activity Type Code
label: Diving

EQUESTRIAN
type: Sporting Activity Type Code
label: Equestrian

FENCING
type: Sporting Activity Type Code
label: Fencing

FISHING
type: Sporting Activity Type Code
label: Fishing

FOOTBALL
type: Sporting Activity Type Code
label: Football

GOLF
type: Sporting Activity Type Code
label: Golf

GYMNASTICS
type: Sporting Activity Type Code
label: Gymnastics

HOCKEY
type: Sporting Activity Type Code
label: Hockey

ICE_HOCKEY
type: Sporting Activity Type Code
label: Ice Hockey

ICE_SKATING
type: Sporting Activity Type Code
label: Ice Skating

MOTOR_CYCLING
type: Sporting Activity Type Code
label: Motor Cycling

RUGBY
type: Sporting Activity Type Code
label: Rugby

RUNNING
type: Sporting Activity Type Code
label: Running

SKIING
type: Sporting Activity Type Code
label: Skiing

SQUASH
type: Sporting Activity Type Code
label: Squash

SURFING
type: Sporting Activity Type Code
label: Surfing

SWIMMING
type: Sporting Activity Type Code
label: Swimming

TENNIS
type: Sporting Activity Type Code
label: Tennis

UNCLASSIFIED
type: Sporting Activity Type Code
label: Unclassified

UNIDENTIFIED
type: Sporting Activity Type Code
label: Unidentified

ACTIVE
type: Status Type
comment: Designation stating that an organisation/party or location is operating. Note that this is independent of whether or not the GLN is active.
label: Active

INACTIVE
type: Status Type
comment: Designation stating that an organisation/party or location is not operating. Note that this is independent of whether or not the GLN is inactive.
label: Inactive

SurfaceDensity
type: Measurement type
label: Surface density
comment: The mass per unit area distributed over a surface. SI Units: kilogram per square metre

SurfaceTension
type: Measurement type
label: Surface tension
comment: The attractive force exerted upon the surface molecules of a liquid by the molecules beneath that tends to draw the surface molecules into the bulk of the liquid and makes the liquid assume the shape having the minimum surface area. SI Units: newton per metre

BRUT
type: Sweetness level of alcoholic beverage
label: Brut
comment: This term is used to describe those products that are labelled Brut (very dry). Please refer to local regulations for allowable sugar content.
term status: stable

BRUT_NATURE
type: Sweetness level of alcoholic beverage
label: Brut nature
comment: This term is used to describe those products that are labelled Brut Nature. Brut nature has no added sugar. Please refer to local regulations for allowable sugar content.
term status: stable

DRY
type: Sweetness level of alcoholic beverage
label: Dry
comment: This term is used to describe those products that are labelled Dry. Also known as Sec Please refer to local regulations for allowable sugar content.
term status: stable

EXTRA_BRUT
type: Sweetness level of alcoholic beverage
label: Extra brut
comment: This term is used to describe those products that are labelled Extra Brut. Please refer to local regulations for allowable sugar content.
term status: stable

EXTRA_DRY
type: Sweetness level of alcoholic beverage
label: Extra dry
comment: This term is used to describe those products that are labelled Extra Dry. Please refer to local regulations for allowable sugar content.
term status: stable

MEDIUM
type: Sweetness level of alcoholic beverage
label: Medium
comment: This term is used to describe those products that are labelled Medium or Medium sweet. Please refer to local regulations for allowable sugar content.
term status: stable

MEDIUM_DRY
type: Sweetness level of alcoholic beverage
label: Medium dry
comment: This term is used to describe those products that are labelled Medium Dry. Also known as Demi-sec. Please refer to local regulations for allowable sugar content.
term status: stable

OFF_DRY
type: Sweetness level of alcoholic beverage
label: Off-Dry
comment: The sugar range that goes beyond the style officially declared as dry and is below the semi-dry declaration. Please refer to local regulations for allowable sugar content. Example: In Germany the term is used to describe wines that are labelled 'Feinherb' (Off-dry). The term isn't part of the local regulation but is allowed to be used as official code according to a specific court ruling.
term status: stable

OTHER
type: Sweetness level of alcoholic beverage
label: Other
comment: The value needed is not listed or is not defined within this list's individual code values and definitions. Please send a work request into GS1 or your solution provider requesting the code you are searching for.
term status: stable

SWEET
type: Sweetness level of alcoholic beverage
label: Sweet/Doux
comment: This term is used to describe those products that are labelled Sweet. Also known as doux in some markets. Please refer to local regulations for allowable sugar content.
term status: stable

FEMALE
type: Target Consumer Gender Code
label: Female

MALE
type: Target Consumer Gender Code
label: Male

UNISEX
type: Target Consumer Gender Code
label: Unisex

Temperature
type: Measurement type
comment: A measure of whether two systems are relatively hot or cold with respect to one another; two systems brought into contact will eventually reach thermal equilibrium and reach the same temperature as thermal energy (heat) flows from the system with higher temperature to the system with lower temperature. SI Units: kelvin

Time
type: Measurement type
comment: A dimension that enables distinction between two otherwise identical events that occur at the same point in space. The interval between such events is the basis of time measurement. SI Units: second

Torque
type: Measurement type
comment: The product of a force and its perpendicular distance from a point about which it causes rotation or torsion. SI Units: newton metre

INSTORE_ONLY
type: Trade Channel Code
comment: Offer avalilable only in stores.
label: Instore Only

OMNICHANNEL
type: Trade Channel Code
comment: Offer avalilable both in stores and online.
label: Omni-channel

ONLINE_ONLY
type: Trade Channel Code
comment: Offer avalilable online only.
label: Online Only

Despatch Advice
type: Transaction Type
comment: Reference number assigned by issuing party to a despatch advice, by means of which the seller or consignor informs the consignee about the despatch of goods. Also called an 'Advanced Shipment Notice', but the value `desadv` is always used regardless of local nomenclature.
term status: provisional

Certificate of conformity
type: Transaction Type
comment: Certificate certifying the conformity to predefined definitions. A document confirming certain characteristics of an object (e.g. product), person, or organisation, typically issued by a third party.
term status: provisional

Receiving Advice Number
type: Transaction Type
comment: A reference number to a receiving advice, which is a document/message that provides the receiver of the shipment the capability to inform the shipper of actual goods received, compared to what was advised as being sent.
term status: provisional

Proposed purchase order reference number
type: Transaction Type
comment: A reference number assigned to a proposed purchase order.
term status: provisional

Product certification number
type: Transaction Type
comment: Number assigned by a governing body (or their agents) to a product which certifies compliance with a standard.GS1 Note: Replaces GS1 Temporary Code XC1.
term status: provisional

Bill of Lading
type: Transaction Type
comment: Reference number assigned to a bill of lading. A document issued by a carrier to a shipper, listing and acknowledging receipt of goods for transport and specifying terms of delivery.
term status: provisional

Blanket order number
type: Transaction Type
comment: Reference number assigned by the order issuer to a blanket order.
term status: provisional

Invoice
type: Transaction Type
comment: Reference number assigned by the seller to a Commercial Invoice. A document/message claiming payment for goods or services supplied under conditions agreed by the seller and buyer.
term status: provisional

Manufacturing Order Number / Production Order
type: Transaction Type
comment: Reference number assigned by manufacturer for a given production quantity of products that references an organisation-internal document or message issued by a producer that initiates a manufacturing process of goods.
term status: provisional

Buyer Order Number
type: Transaction Type
comment: Reference number assigned by the buyer to an order.
term status: provisional

Order Number (Supplier)
type: Transaction Type
comment: Reference number assigned by supplier to a buyer's purchase order.
term status: provisional

CLOSED_TOE_CLOSED_BACK_OPEN_INSTEP
type: Upper Type Code
label: Closed Toe Closed Back Open Instep

CLOSED_TOE_OPEN_BACK
type: Upper Type Code
label: Closed Toe Open Back

CLOSED_TOE_STRAP_BACK
type: Upper Type Code
label: Closed Toe Strap Back

FULLY_CLOSED
type: Upper Type Code
label: Fully Closed

OPEN_TOE_FULLY_CLOSED_BACK
type: Upper Type Code
label: Open Toe Fully Closed Back

OPEN_TOE_OPEN_BACK
type: Upper Type Code
label: Open Toe Open Back

OPEN_TOE_STRAP_BACK
type: Upper Type Code
label: Open Toe Strap Back

UNCLASSIFIED
type: Upper Type Code
label: Unclassified

Voltage
type: Measurement type
comment: The value of an electromotive force or electrostatic potential difference, expressed in volts. SI Units: volt

Volume
type: Measurement type
comment: The amount of three-dimensional space occupied by a body, measured in cubic length units. SI Units: cubic metre

VolumeFlowRate
type: Measurement type
label: Volume flow rate
comment: The volume of fluid that passes per unit of time. SI Units: cubic metre per second

VolumeFraction
type: Measurement type
label: Volume fraction
comment: The dimensionless ratio of a volume of one substance to the volume of solid, liquid or gas in which it is contained. Typical units: parts per million, parts per billion, etc.

VolumetricFlux
type: Measurement type
label: Volumetric flux
comment: The volume of fluid that passes per unit of time per unit area perpendicular to the flow direction. SI Units: cubic metre per second per square metre

Wavenumber
type: Measurement type
comment: The number of waves per unit length. SI Units: reciprocal metre

GS1 Application Identifier
type: Datatype
comment: A Data Type that corresponds to GS1 Application Identifiers defined in the GS1 General Specifications
term status: stable

restricted
type: AnnotationProperty
range: xsd:string